{"text_format":"1","workbook":"xlsx","n_sheets":4,"sheets":["参照名簿","通所介護計画","保存情報","マスタ登録"],"not_rendered":{"charts":0,"images":0,"macros":1,"external_links":0,"defined_names":1,"comments":0,"pivot_tables":0},"unopened":[],"bounds":{"document_bytes":16777216,"sheet_cells":100000,"rows_first":2000,"rows_last":500,"rows_between":2000,"halvings":0,"cell_chars":16384,"cell_head_chars":4096},"cells_cut":0,"cells_raw":0,"read":"whole","date_system":"1900"}

{"sheet":"参照名簿","index":0,"n_rows":29,"n_cols":16,"rows_kept":29,"cut":false,"hidden":false,"merged":[[1,2,1,4]]}
[]
[null,"整列","参照名簿",null,null,"番号をクリックすると通所介護計画を呼び出せます。"]
[null,null,null,null,null,null,null,null,null,"※このページには直接入力できません！"]
[null,null,"番号","お名前","番号","お名前","番号","お名前","番号","お名前","番号","お名前","番号","お名前",null,1]
[null,null,1,{"$f":"保存情報!F7","v":"モデル計画"},26,{"$f":"保存情報!F32","v":0},51,{"$f":"保存情報!F57","v":0},76,{"$f":"保存情報!F82","v":0},101,{"$f":"保存情報!F107","v":0},126,{"$f":"保存情報!F132","v":0}]
[null,null,2,{"$f":"保存情報!F8","v":0},27,{"$f":"保存情報!F33","v":0},52,{"$f":"保存情報!F58","v":0},77,{"$f":"保存情報!F83","v":0},102,{"$f":"保存情報!F108","v":0},127,{"$f":"保存情報!F133","v":0}]
[null,null,3,{"$f":"保存情報!F9","v":0},28,{"$f":"保存情報!F34","v":0},53,{"$f":"保存情報!F59","v":0},78,{"$f":"保存情報!F84","v":0},103,{"$f":"保存情報!F109","v":0},128,{"$f":"保存情報!F134","v":0}]
[null,null,4,{"$f":"保存情報!F10","v":0},29,{"$f":"保存情報!F35","v":0},54,{"$f":"保存情報!F60","v":0},79,{"$f":"保存情報!F85","v":0},104,{"$f":"保存情報!F110","v":0},129,{"$f":"保存情報!F135","v":0}]
[null,null,5,{"$f":"保存情報!F11","v":0},30,{"$f":"保存情報!F36","v":0},55,{"$f":"保存情報!F61","v":0},80,{"$f":"保存情報!F86","v":0},105,{"$f":"保存情報!F111","v":0},130,{"$f":"保存情報!F136","v":0}]
[null,null,6,{"$f":"保存情報!F12","v":0},31,{"$f":"保存情報!F37","v":0},56,{"$f":"保存情報!F62","v":0},81,{"$f":"保存情報!F87","v":0},106,{"$f":"保存情報!F112","v":0},131,{"$f":"保存情報!F137","v":0}]
[null,null,7,{"$f":"保存情報!F13","v":0},32,{"$f":"保存情報!F38","v":0},57,{"$f":"保存情報!F63","v":0},82,{"$f":"保存情報!F88","v":0},107,{"$f":"保存情報!F113","v":0},132,{"$f":"保存情報!F138","v":0}]
[null,null,8,{"$f":"保存情報!F14","v":0},33,{"$f":"保存情報!F39","v":0},58,{"$f":"保存情報!F64","v":0},83,{"$f":"保存情報!F89","v":0},108,{"$f":"保存情報!F114","v":0},133,{"$f":"保存情報!F139","v":0}]
[null,null,9,{"$f":"保存情報!F15","v":0},34,{"$f":"保存情報!F40","v":0},59,{"$f":"保存情報!F65","v":0},84,{"$f":"保存情報!F90","v":0},109,{"$f":"保存情報!F115","v":0},134,{"$f":"保存情報!F140","v":0}]
[null,null,10,{"$f":"保存情報!F16","v":0},35,{"$f":"保存情報!F41","v":0},60,{"$f":"保存情報!F66","v":0},85,{"$f":"保存情報!F91","v":0},110,{"$f":"保存情報!F116","v":0},135,{"$f":"保存情報!F141","v":0}]
[null,null,11,{"$f":"保存情報!F17","v":0},36,{"$f":"保存情報!F42","v":0},61,{"$f":"保存情報!F67","v":0},86,{"$f":"保存情報!F92","v":0},111,{"$f":"保存情報!F117","v":0},136,{"$f":"保存情報!F142","v":0}]
{"$rows_left_out":15}
{"sheet":"通所介護計画","index":1,"n_rows":68,"n_cols":161,"rows_kept":68,"cut":false,"hidden":false,"merged":[[5,12,5,16],[24,1,24,6],[24,7,24,11],[24,12,24,16],[27,2,27,5],[8,3,8,6],[9,7,9,8],[9,9,9,14],[8,9,8,14],[8,15,8,16],[11,13,11,16],[27,13,27,16],[27,11,27,12],[27,6,27,10],[8,1,8,2],[10,1,10,2],[10,6,10,16],[9,1,9,2],[10,4,10,5],[8,7,8,8],[9,3,9,6],[9,15,9,16],[13,10,13,12],[13,13,13,16],[17,1,18,2],[16,1,16,8],[16,9,16,16],[19,1,20,2],[17,3,18,8],[19,3,20,8],[17,9,20,16],[23,1,23,6],[23,7,23,11],[23,12,23,16],[22,1,22,16],[13,5,13,9],[6,8,6,11],[4,8,4,11],[5,8,5,11],[3,1,3,16],[7,7,7,11],[7,12,7,16],[14,1,14,4],[14,5,14,9],[14,10,14,12],[11,10,11,12],[11,1,11,2],[11,3,11,9],[6,6,6,7],[7,1,7,2],[7,3,7,6],[6,12,6,16],[13,1,13,4],[12,1,12,2],[12,3,12,4],[12,8,12,11],[12,13,12,16],[12,5,12,7],[14,13,14,16],[26,1,26,16],[32,1,32,16],[36,8,36,10],[38,8,38,10],[34,8,34,9],[36,11,36,15],[38,11,38,16],[41,1,41,16],[42,1,42,3],[42,4,42,7],[42,8,42,16],[28,2,28,5],[28,6,28,10],[28,11,28,12],[28,13,28,16],[29,2,29,5],[29,6,29,10],[29,11,29,12],[29,13,29,16],[48,4,48,7],[48,8,48,16],[30,2,30,5],[30,6,30,10],[30,11,30,12],[30,13,30,16],[31,2,31,5],[31,6,31,10],[31,11,31,12],[31,13,31,16],[54,4,54,7],[54,8,54,16],[55,1,55,3],[55,4,55,7],[55,8,55,16],[56,1,56,3],[56,4,56,7],[56,8,56,16],[43,1,43,3],[43,4,43,7],[43,8,43,16],[44,1,44,3],[44,4,44,7],[44,8,44,16],[45,1,45,3],[45,4,45,7],[45,8,45,16],[46,1,46,3],[46,4,46,7],[46,8,46,16],[47,1,47,3],[47,4,47,7],[47,8,47,16],[48,1,48,3],[49,1,49,3],[49,4,49,7],[49,8,49,16],[51,1,51,3],[51,4,51,7],[51,8,51,16],[53,1,53,3],[53,4,53,7],[53,8,53,16],[63,1,63,5],[64,1,64,5],[62,6,62,12],[63,6,63,12],[64,6,64,12],[50,1,50,3],[50,4,50,7],[50,8,50,16],[52,1,52,3],[52,4,52,7],[52,8,52,16],[57,1,57,3],[57,4,57,7],[57,8,57,16],[60,1,60,3],[60,4,60,7],[60,8,60,16],[61,1,61,3],[61,4,61,7],[61,8,61,16],[58,1,58,16],[59,1,59,16],[62,1,62,5],[54,1,54,3],[10,19,10,20],[10,22,10,23],[10,24,10,34],[11,19,11,20],[11,21,11,27],[11,28,11,30],[11,31,11,34],[12,19,12,20],[12,21,12,22],[12,23,12,25],[12,26,12,29],[12,31,12,34],[13,19,13,22],[13,23,13,27],[13,28,13,30],[13,31,13,34],[14,19,14,22],[14,23,14,27],[14,28,14,30],[14,31,14,34],[16,19,16,26],[16,27,16,34],[17,19,18,20],[17,21,18,26],[17,27,20,34],[19,19,20,20],[19,21,20,26],[22,19,22,34],[23,19,23,24],[23,25,23,29],[23,30,23,34],[24,19,24,24],[24,25,24,29],[24,30,24,34],[26,19,26,34],[27,20,27,23],[27,24,27,28],[27,29,27,30],[27,31,27,34],[28,20,28,23],[28,24,28,28],[28,29,28,30],[28,31,28,34],[29,20,29,23],[29,24,29,28],[29,29,29,30],[29,31,29,34],[30,20,30,23],[30,24,30,28],[30,29,30,30],[30,31,30,34],[31,20,31,23],[31,24,31,28],[31,29,31,30],[31,31,31,34],[32,19,32,34],[34,26,34,27],[36,26,36,28],[36,29,36,33],[38,26,38,28],[38,29,38,34],[41,19,41,34],[42,19,42,21],[42,22,42,25],[42,26,42,34],[43,19,43,21],[43,22,43,25],[43,26,43,34],[44,19,44,21],[44,22,44,25],[44,26,44,34],[45,19,45,21],[45,22,45,25],[45,26,45,34],[46,19,46,21],[46,22,46,25],[46,26,46,34],[47,19,47,21],[47,22,47,25],[47,26,47,34],[48,19,48,21],[48,22,48,25],[48,26,48,34],[49,19,49,21],[49,22,49,25],[49,26,49,34],[50,19,50,21],[50,22,50,25],[50,26,50,34],[51,19,51,21],[51,22,51,25],[51,26,51,34],[52,19,52,21],[52,22,52,25],[52,26,52,34],[53,19,53,21],[53,22,53,25],[53,26,53,34],[54,19,54,21],[54,22,54,25],[54,26,54,34],[55,19,55,21],[55,22,55,25],[55,26,55,34],[56,19,56,21],[56,22,56,25],[56,26,56,34],[57,19,57,21],[57,22,57,25],[57,26,57,34],[58,19,58,34],[59,19,59,34],[60,19,60,21],[60,22,60,25],[60,26,60,34],[61,19,61,21],[61,22,61,25],[61,26,61,34],[62,19,62,23],[62,24,62,30],[8,19,8,20],[8,21,8,24],[8,25,8,26],[8,27,8,32],[8,33,8,34],[9,19,9,20],[9,21,9,24],[9,25,9,26],[9,27,9,32],[9,33,9,34],[3,19,3,34],[4,26,4,29],[5,26,5,29],[5,30,5,34],[6,24,6,25],[6,26,6,29],[6,30,6,34],[7,19,7,20],[7,21,7,24],[7,25,7,29],[7,30,7,34],[63,19,63,23],[63,24,63,30],[64,19,64,23],[64,24,64,30],[3,37,3,52],[4,44,4,47],[5,44,5,47],[5,48,5,52],[6,42,6,43],[6,44,6,47],[6,48,6,52],[7,37,7,38],[7,39,7,42],[7,43,7,47],[7,48,7,52],[8,37,8,38],[8,39,8,42],[8,43,8,44],[8,45,8,50],[8,51,8,52],[9,37,9,38],[9,39,9,42],[9,43,9,44],[9,45,9,50],[9,51,9,52],[10,37,10,38],[10,40,10,41],[10,42,10,52],[11,37,11,38],[11,39,11,45],[11,46,11,48],[11,49,11,52],[12,37,12,38],[12,39,12,40],[12,41,12,43],[12,44,12,47],[12,49,12,52],[13,37,13,40],[13,41,13,45],[13,46,13,48],[13,49,13,52],[14,37,14,40],[14,41,14,45],[14,46,14,48],[14,49,14,52],[16,37,16,44],[16,45,16,52],[17,37,18,38],[17,39,18,44],[17,45,20,52],[19,37,20,38],[19,39,20,44],[22,37,22,52],[23,37,23,42],[23,43,23,47],[23,48,23,52],[24,37,24,42],[24,43,24,47],[24,48,24,52],[26,37,26,52],[27,38,27,41],[27,42,27,46],[27,47,27,48],[27,49,27,52],[28,38,28,41],[28,42,28,46],[28,47,28,48],[28,49,28,52],[29,38,29,41],[29,42,29,46],[29,47,29,48],[29,49,29,52],[30,38,30,41],[30,42,30,46],[30,47,30,48],[30,49,30,52],[31,38,31,41],[31,42,31,46],[31,47,31,48],[31,49,31,52],[32,37,32,52],[34,44,34,45],[36,44,36,46],[36,47,36,51],[38,44,38,46],[38,47,38,52],[41,37,41,52],[42,37,42,39],[42,40,42,43],[42,44,42,52],[43,37,43,39],[43,40,43,43],[43,44,43,52],[44,37,44,39],[44,40,44,43],[44,44,44,52],[45,37,45,39],[45,40,45,43],[45,44,45,52],[46,37,46,39],[46,40,46,43],[46,44,46,52],[47,37,47,39],[47,40,47,43],[47,44,47,52],[48,37,48,39],[48,40,48,43],[48,44,48,52],[49,37,49,39],[49,40,49,43],[49,44,49,52],[50,37,50,39],[50,40,50,43],[50,44,50,52],[51,37,51,39],[51,40,51,43],[51,44,51,52],[52,37,52,39],[52,40,52,43],[52,44,52,52],[53,37,53,39],[53,40,53,43],[53,44,53,52],[54,37,54,39],[54,40,54,43],[54,44,54,52],[55,37,55,39],[55,40,55,43],[55,44,55,52],[56,37,56,39],[56,40,56,43],[56,44,56,52],[57,37,57,39],[57,40,57,43],[57,44,57,52],[63,37,63,41],[63,42,63,48],[64,37,64,41],[64,42,64,48],[58,37,58,52],[59,37,59,52],[60,37,60,39],[60,40,60,43],[60,44,60,52],[61,37,61,39],[61,40,61,43],[61,44,61,52],[62,37,62,41],[62,42,62,48],[19,150,20,155],[23,148,23,153],[23,154,23,158],[23,159,23,163],[16,148,16,155],[16,156,16,163],[7,66,7,69],[6,153,6,154],[6,159,6,163],[11,148,13,163],[24,159,24,163],[27,149,27,152],[27,153,27,157],[27,158,27,159],[27,160,27,163],[28,149,28,152],[28,153,28,157],[28,158,28,159],[28,160,28,163],[34,155,34,156],[36,155,36,157],[36,158,36,162],[38,155,38,157],[38,158,38,163],[42,148,42,150],[42,151,42,154],[42,155,42,163],[29,158,29,159],[29,160,29,163],[30,149,30,152],[30,153,30,157],[30,158,30,159],[30,160,30,163],[31,149,31,152],[31,153,31,157],[31,158,31,159],[31,160,31,163],[57,148,57,150],[57,151,57,154],[57,155,57,163],[52,148,52,150],[52,151,52,154],[52,155,52,163],[53,148,53,150],[53,151,53,154],[53,155,53,163],[54,148,54,150],[54,151,54,154],[54,155,54,163],[55,155,55,163],[56,148,56,150],[56,151,56,154],[56,155,56,163],[50,155,50,163],[51,148,51,150],[51,151,51,154],[51,155,51,163],[15,148,15,151],[22,148,22,151],[26,148,26,151],[41,148,41,151],[46,155,46,163],[47,148,47,150],[47,151,47,154],[47,155,47,163],[48,148,48,150],[48,151,48,154],[48,155,48,163],[49,148,49,150],[43,155,43,163],[44,148,44,150],[44,151,44,154],[44,155,44,163],[45,148,45,150],[45,151,45,154],[45,155,45,163],[32,148,32,163],[61,132,61,138],[63,148,63,154],[15,144,16,144],[22,144,23,144],[26,144,27,144],[41,144,42,144],[55,148,55,150],[55,151,55,154],[46,148,46,150],[46,151,46,154],[43,148,43,150],[43,151,43,154],[29,149,29,152],[29,153,29,157],[24,148,24,153],[24,154,24,158],[17,148,18,149],[17,150,18,155],[17,156,20,163],[19,148,20,149],[49,151,49,154],[49,155,49,163],[50,148,50,150],[50,151,50,154]]}
[null,"コード",null,null,null,null,null,null,null,null,null,null,null,null,null,null,null,null,null,null,null,null,null,null,null,null,null,null,null,null,null,null,null,null,null,null,null,null,null,null,null,null,null,null,null,null,null,null,null,null,null,null,null,null,null,"レコード数"]
[null,null,null,"呼出",null,"新規",null,"参照",null,null,"印刷",null,"連続印刷",null,null,"～",null,null,null,null,{"$f":"IF(O2*Q2<=0,0,1)*IF(O2>=Q2,0,1)","v":0},null,null,null,null,null,null,null,null,null,null,null,null,null,null,null,null,"転写",null,"戻る",null,null,null,null,null,null,null,null,null,null,null,null,null,null,null,{"$f":"COUNTA(保存情報!G7:G156)","v":1},1,2,3,4,5,6,7,8,9,10,11,12,13,14,15,16,17,18,19,20,21,22,23,24,25,26,27,28,29,30,31,32,33,34,35,36,37,38,39,40,41,42,43,44,45,46,47,48,49,50,51,52,53,54,55,56,57,58,59,60,61,62,63,64,65,66,67,68,69,70,71,72,73,74,75,76,77,78,79,80,81,82,83,84,85,86,87,88]
[]
[null,"通所介護計画書",null,null,null,null,null,null,null,null,null,null,null,null,null,null,null,null,null,"通所介護計画書",null,null,null,null,null,null,null,null,null,null,null,null,null,null,null,null,null,"通所介護計画書",null,null,null,null,null,null,null,null,null,null,null,null,null,null,null,null,null,"判定","お名前","フリガナ","性別","生年月日","郵便番号","住所","TEL","介護度","前回計画作成日","介護保険証\n有効開始日","介護保険証\n有効末日","被保険者番号","市町村名","居宅支援事業者","介護支援専門員名","作成年月日","記録作成者氏名","本人の希望","家族の希望","サービス利用上の留意点","解決すべきニーズ","長期目標","短期目標","①サービス内容","①具体的な対応・注意点","①期間","①評価・変更","②サービス内容","②具体的な対応・注意点","②期間","②評価・変更","③サービス内容","③具体的な対応・注意点","③期間","③評価・変更","④サービス内容","④具体的な対応・注意点","④期間","④評価・変更","①予定時間","①サービス提供内容","①具体的対応・留意点","②予定時間","②サービス提供内容","②具体的対応・留意点","➂予定時間","➂サービス提供内容","➂具体的対応・留意点","④予定時間","④サービス提供内容","④具体的対応・留意点","⑤予定時間","⑤サービス提供内容","⑤具体的対応・留意点","⑥予定時間","⑥サービス提供内容","⑥具体的対応・留意点","⑦予定時間","⑦サービス提供内容","⑦具体的対応・留意点","⑧予定時間","⑧サービス提供内容","⑧具体的対応・留意点","⑨予定時間","⑨サービス提供内容","⑨具体的対応・留意点","⑩予定時間","⑩サービス提供内容","⑩具体的対応・留意点","⑪予定時間","⑪サービス提供内容","⑪具体的対応・留意点","⑫予定時間","⑫サービス提供内容","⑫具体的対応・留意点","⑬予定時間","⑬サービス提供内容","⑬具体的対応・留意点","⑭予定時間","⑭サービス提供内容","⑭具体的対応・留意点","⑮予定時間","⑮サービス提供内容","⑮具体的対応・留意点","その他の留意事項","提供時間","報酬区分","利用予定"]
[null,null,null,null,null,null,null,null,null,null,null,null,null,null,null,null,null,null,null,null,null,null,null,null,null,null,null,null,null,null,null,null,null,null,null,null,null,null,null,null,null,null,null,null,null,null,null,null,null,null,null,null,null,null,null,{"$f":"IF(OR(AN9=\"\",AN9=0),0,1)","v":0},{"$f":"$AN$10","v":""},{"$f":"$AN$9","v":""},{"$f":"$AR$10","v":""},{"$f":"$AT$10","v":""},{"$f":"$AO$11","v":""},{"$f":"$AQ$11","v":""},{"$f":"$AN$12","v":""},{"$f":"$AN$13","v":""},{"$f":"$AX$12","v":""},{"$f":"$AS$13","v":""},{"$f":"$AX$13","v":""},{"$f":"$AP$14","v":""},{"$f":"$AX$14","v":"市原市"},{"$f":"$AP$15","v":"介護サポートたつみ"},{"$f":"$AX$15","v":""},{"$f":"$AN$8","v":""},{"$f":"$AW$8","v":""},{"$f":"$AN$18","v":""},{"$f":"$AN$20","v":""},{"$f":"$AT$18","v":""},{"$f":"$AL$25","v":""},{"$f":"$AR$25","v":""},{"$f":"$AW$25","v":""},{"$f":"$AM$29","v":""},{"$f":"$AQ$29","v":""},{"$f":"$AV$29","v":""},{"$f":"$AX$29","v":""},{"$f":"$AM$30","v":""},{"$f":"$AQ$30","v":""},{"$f":"$AV$30","v":""},{"$f":"$AX$30","v":""},{"$f":"$AM$31","v":""},{"$f":"$AQ$31","v":""},{"$f":"$AV$31","v":""},{"$f":"$AX$31","v":""},{"$f":"$AM$32","v":""},{"$f":"$AQ$32","v":""},{"$f":"$AV$32","v":""},{"$f":"$AX$32","v":""},{"$f":"$AL$44","v":""},{"$f":"$AO$44","v":""},{"$f":"$AS$44","v":""},{"$f":"$AL$45","v":""},{"$f":"$AO$45","v":""},{"$f":"$AS$45","v":""},{"$f":"$AL$46","v":""},{"$f":"$AO$46","v":""},{"$f":"$AS$46","v":""},{"$f":"$AL$47","v":""},{"$f":"$AO$47","v":""},{"$f":"$AS$47","v":""},{"$f":"$AL$48","v":""},{"$f":"$AO$48","v":""},{"$f":"$AS$48","v":""},{"$f":"$AL$49","v":""},{"$f":"$AO$49","v":""},{"$f":"$AS$49","v":""},{"$f":"$AL$50","v":""},{"$f":"$AO$50","v":""},{"$f":"$AS$50","v":""},{"$f":"$AL$51","v":""},{"$f":"$AO$51","v":""},{"$f":"$AS$51","v":""},{"$f":"$AL$52","v":""},{"$f":"$AO$52","v":""},{"$f":"$AS$52","v":""},{"$f":"$AL$53","v":""},{"$f":"$AO$53","v":""},{"$f":"$AS$53","v":""},{"$f":"$AL$54","v":""},{"$f":"AO$54","v":""},{"$f":"$AS$54","v":""},{"$f":"$AL$55","v":""},{"$f":"$AO$55","v":""},{"$f":"$AS$55","v":""},{"$f":"$AL$56","v":""},{"$f":"$AO$56","v":""},{"$f":"$AS$56","v":""},{"$f":"$AL$57","v":""},{"$f":"$AO$57","v":""},{"$f":"$AS$57","v":""},{"$f":"$AL$58","v":""},{"$f":"$AO$58","v":""},{"$f":"$AS$58","v":""},{"$f":"$AL$60","v":""},{"$f":"$AQ$63","v":""},{"$f":"$AQ$64","v":""},{"$f":"$AQ$65","v":""}]
[null,null,null,null,null,null,null,null,"事業所名",null,null,null,{"$f":"マスタ登録!D16","v":"デイサービスたつみの森"},null,null,null,null,null,null,null,null,null,null,null,null,null,"事業所名",null,null,null,{"$f":"$M$6","v":"デイサービスたつみの森"},null,null,null,null,null,null,null,null,null,null,null,null,null,"事業所名",null,null,null,{"$f":"AE6","v":"デイサービスたつみの森"},null,null,null,null,null,null,{"$f":"参照名簿!$P$4","v":1}]
[]
[null,"作成年月日",null,{"$f":"IF($B$2=\"\",\"\",VLOOKUP($B$2,保存情報!$E$5:$CO$156,17))","v":""},null,null,null,"記録作成者氏名",null,null,null,null,{"$f":"IF($B$2=\"\",\"\",VLOOKUP($B$2,保存情報!$E$5:$CO$156,18))","v":""},null,null,null,null,null,null,"作成年月日",null,{"$f":"$D$8","v":""},null,null,null,"記録作成者氏名",null,null,null,null,{"$f":"$M$8","v":""},null,null,null,null,null,null,"作成年月日",null,"",null,null,null,"記録作成者氏名",null,null,null,null,"",null,null,null,null,null,null,"番号","性別","記録作成者","介護度","市町村名","居宅介護支援事業所","介護支援専門員","提供時間","報酬区分",null,null,{"$f":"NOW()","v":"2015-02-06T15:54:48.020"}]
[null,"フリガナ",null,{"$f":"IF($B$2=\"\",\"\",VLOOKUP($B$2,保存情報!$E$6:$CO$156,3))","v":""},null,null,null,"性別",null,"生年月日",null,null,null,null,null,"年齢",null,null,null,"フリガナ",null,{"$f":"$D$9","v":""},null,null,null,"性別",null,"生年月日",null,null,null,null,null,"年齢",null,null,null,"フリガナ",null,"",null,null,null,"性別",null,"生年月日",null,null,null,null,null,"年齢",null,null,null,1,{"$f":"マスタ登録!C4","v":"女"},{"$f":"マスタ登録!D4","v":"佐藤一郎"},{"$f":"マスタ登録!E4","v":5},{"$f":"マスタ登録!F4","v":"市原市"},{"$f":"マスタ登録!G4","v":"介護サポートたつみ"},{"$f":"マスタ登録!H4","v":"山田太郎"},{"$f":"マスタ登録!I4","v":"７～９時間"},{"$f":"マスタ登録!J4","v":"通所介護Ⅱ３"}]
[null,"氏名",null,{"$f":"IF($B$2=\"\",\"\",VLOOKUP($B$2,保存情報!$E$7:$CO$156,2))","v":""},null,null,null,{"$f":"IF($B$2=\"\",\"\",VLOOKUP($B$2,保存情報!$E$5:$CO$156,4))","v":""},null,{"$f":"IF($B$2=\"\",\"\",VLOOKUP($B$2,保存情報!$E$5:$CO$156,5))","v":""},null,null,null,null,null,{"$f":"IF($B$2=\"\",\"\",IF($J$10=0,\"\",DATEDIF($J$10,TODAY(),\"y\")))","v":""},null,null,null,"氏名",null,{"$f":"$D$10","v":""},null,null,null,{"$f":"$H$10","v":""},null,{"$f":"$J$10","v":""},null,null,null,null,null,{"$f":"P10","v":""},null,null,null,"氏名",null,"",null,null,null,"",null,"",null,null,null,null,null,"",null,null,null,2,{"$f":"マスタ登録!C5","v":"男"},{"$f":"マスタ登録!D5","v":"　"},{"$f":"マスタ登録!E5","v":4},{"$f":"マスタ登録!F5","v":"　"},{"$f":"マスタ登録!G5","v":"　　"},{"$f":"マスタ登録!H5","v":"　"},{"$f":"マスタ登録!I5","v":"４～７時間"},{"$f":"マスタ登録!J5","v":"通所介護Ⅱ２"}]
[null,"住所",null,"〒",{"$f":"IF($B$2=\"\",\"\",VLOOKUP($B$2,保存情報!$E$5:$CO$156,6))","v":""},null,{"$f":"IF($B$2=\"\",\"\",VLOOKUP($B$2,保存情報!$E$5:$CO$156,7))","v":""},null,null,null,null,null,null,null,null,null,null,null,null,"住所",null,"〒",{"$f":"$E$11","v":""},null,{"$f":"$G$11","v":""},null,null,null,null,null,null,null,null,null,null,null,null,"住所",null,"〒","",null,"",null,null,null,null,null,null,null,null,null,null,null,null,3,{"$f":"マスタ登録!C6","v":0},{"$f":"マスタ登録!D6","v":"　"},{"$f":"マスタ登録!E6","v":3},{"$f":"マスタ登録!F6","v":"　"},{"$f":"マスタ登録!G6","v":"　　"},{"$f":"マスタ登録!H6","v":"　"},{"$f":"マスタ登録!I6","v":"　"},{"$f":"マスタ登録!J6","v":"予防通所介護１"}]
[null,"TEL",null,{"$f":"IF($B$2=\"\",\"\",VLOOKUP($B$2,保存情報!$E$5:$CO$156,8))","v":""},null,null,null,null,null,null,"前回計画作成日",null,null,{"$f":"IF($B$2=\"\",\"\",VLOOKUP($B$2,保存情報!$E$5:$CO$156,10))","v":""},null,null,null,null,null,"TEL",null,{"$f":"$D$12","v":""},null,null,null,null,null,null,"前回計画作成日",null,null,{"$f":"$N$12","v":""},null,null,null,null,null,"TEL",null,"",null,null,null,null,null,null,"前回計画作成日",null,null,"",null,null,null,null,null,4,{"$f":"マスタ登録!C7","v":0},{"$f":"マスタ登録!D7","v":"　"},{"$f":"マスタ登録!E7","v":2},{"$f":"マスタ登録!F7","v":"　"},{"$f":"マスタ登録!G7","v":"　　"},{"$f":"マスタ登録!H7","v":"　"},{"$f":"マスタ登録!I7","v":"　"},{"$f":"マスタ登録!J7","v":"予防通所介護２"},null,null,null,null,null,null,null,null,null,null,null,null,null,null,null,null,null,null,null,null,null,null,null,null,null,null,null,null,null,null,null,null,null,null,null,null,null,null,null,null,null,null,null,null,null,null,null,null,null,null,null,null,null,null,null,null,null,null,null,null,null,null,null,null,null,null,null,null,null,null,null,null,null,null,null,null,null,null,null,null,null,null,null,null,"参照したい人の部分記録を呼び出して、そっくりそのまま転写することも可能です。\n左の参照ＢＯＸにコード番号を入れて、転写ボタンを右クリックしてください。\n参照コードを右クリックすると参照コードが一つ増え、次の方を参照できます。"]
[null,"介護度",null,{"$f":"IF($B$2=\"\",\"\",VLOOKUP($B$2,保存情報!$E$5:$CO$156,9))","v":""},null,"認定有効期間",null,null,{"$f":"IF($B$2=\"\",\"\",VLOOKUP($B$2,保存情報!$E$5:$CO$156,11))","v":""},null,null,null,"～",{"$f":"IF($B$2=\"\",\"\",VLOOKUP($B$2,保存情報!$E$5:$CO$156,12))","v":""},null,null,null,null,null,"介護度",null,{"$f":"$D$13","v":""},null,"認定有効期間",null,null,{"$f":"$I$13","v":""},null,null,null,"～",{"$f":"$N$13","v":""},null,null,null,null,null,"介護度",null,"",null,"認定有効期間",null,null,"",null,null,null,"～","",null,null,null,null,null,5,{"$f":"マスタ登録!C8","v":0},{"$f":"マスタ登録!D8","v":"　"},{"$f":"マスタ登録!E8","v":1},{"$f":"マスタ登録!F8","v":"　"},{"$f":"マスタ登録!G8","v":"　　"},{"$f":"マスタ登録!H8","v":"　"},{"$f":"マスタ登録!I8","v":"　"},{"$f":"マスタ登録!J8","v":"介護予防支援事業"}]
[null,"介護保険被保険者番号",null,null,null,{"$f":"IF($B$2=\"\",\"\",VLOOKUP($B$2,保存情報!$E$5:$CO$156,13))","v":""},null,null,null,null,"市町村名",null,null,{"$f":"IF($B$2=\"\",\"\",VLOOKUP($B$2,保存情報!$E$5:$CO$156,14))","v":""},null,null,null,null,null,"介護保険被保険者番号",null,null,null,{"$f":"$F$14","v":""},null,null,null,null,"市町村名",null,null,{"$f":"IF($N$14=\"\",$BH$9,$N$14)","v":"市原市"},null,null,null,null,null,"介護保険被保険者番号",null,null,null,"",null,null,null,null,"市町村名",null,null,"市原市",null,null,null,null,null,6,{"$f":"マスタ登録!C9","v":0},{"$f":"マスタ登録!D9","v":"　"},{"$f":"マスタ登録!E9","v":"要支援１"},{"$f":"マスタ登録!F9","v":"　"},{"$f":"マスタ登録!G9","v":0},{"$f":"マスタ登録!H9","v":"　"},{"$f":"マスタ登録!I9","v":"　"},{"$f":"マスタ登録!J9","v":"　"}]
[null,"居宅支援事業者名",null,null,null,{"$f":"IF($B$2=\"\",\"\",VLOOKUP($B$2,保存情報!$E$5:$CO$156,15))","v":""},null,null,null,null,"介護支援専門員名",null,null,{"$f":"IF($B$2=\"\",\"\",VLOOKUP($B$2,保存情報!$E$5:$CO$156,16))","v":""},null,null,null,null,null,"居宅支援事業者名",null,null,null,{"$f":"IF($F$15=\"\",$BI$9,$F$15)","v":"介護サポートたつみ"},null,null,null,null,"介護支援専門員名",null,null,{"$f":"$N$15","v":""},null,null,null,null,null,"居宅支援事業者名",null,null,null,"介護サポートたつみ",null,null,null,null,"介護支援専門員名",null,null,"",null,null,null,null,null,7,{"$f":"マスタ登録!C10","v":0},{"$f":"マスタ登録!D10","v":"　"},{"$f":"マスタ登録!E10","v":"要支援２"},{"$f":"マスタ登録!F10","v":"　"},{"$f":"マスタ登録!G10","v":"　　"},{"$f":"マスタ登録!H10","v":"　"},{"$f":"マスタ登録!I10","v":"　"},{"$f":"マスタ登録!J10","v":"　"},null,null,null,null,null,null,null,null,null,null,null,null,null,null,null,null,null,null,null,null,null,null,null,null,null,null,null,null,null,null,null,null,null,null,null,null,null,null,null,null,null,null,null,null,null,null,null,null,null,null,null,null,null,null,null,null,null,null,null,null,null,null,null,null,null,null,null,null,null,null,null,null,null,null,null,null,null,null,null,null,"参照"]
{"$rows_left_out":54}
{"sheet":"保存情報","index":2,"n_rows":156,"n_cols":93,"rows_kept":156,"cut":false,"hidden":false,"merged":[[3,8,3,10],[2,7,2,11]]}
[]
[null,null,null,null,null,null,"削除番号"]
[null,null,null,"整列",null,null,null,{"$f":"IF(G3=\"\",\"\",VLOOKUP(G3,E6:F156,2)&\"様の記録を削除してもよろしいですか？\")","v":""},null,null,null,null,"削除"]
[null,null,null,null,null,null,null,null,"基本情報保存画面",null,null,null,null,null,"※このページは直接入力修正ができます。",null,null,null,null,16,17,18,19,20,21,22,23,24,25,26,27,28,29,30,31,32,33]
[]
[null,null,null,null,"番号","お名前","フリガナ","性別","生年月日","郵便番号","住所","TEL","介護度","前回計画作成日","介護保険証\n有効開始日","介護保険証\n有効末日","被保険者番号","市町村名","居宅支援事業者","介護支援専門員名","作成年月日","記録作成者氏名","本人の希望","家族の希望","サービス利用上の留意点","解決すべきニーズ","長期目標","短期目標","①サービス内容","①具体的な対応・注意点","①期間","①評価・変更","②サービス内容","②具体的な対応・注意点","②期間","②評価・変更","③サービス内容","③具体的な対応・注意点","③期間","③評価・変更","④サービス内容","④具体的な対応・注意点","④期間","④評価・変更","①予定時間","①サービス提供内容","①具体的対応・留意点","②予定時間","②サービス提供内容","②具体的対応・留意点","➂予定時間","➂サービス提供内容","➂具体的対応・留意点","④予定時間","④サービス提供内容","④具体的対応・留意点","⑤予定時間","⑤サービス提供内容","⑤具体的対応・留意点","⑥予定時間","⑥サービス提供内容","⑥具体的対応・留意点","⑦予定時間","⑦サービス提供内容","⑦具体的対応・留意点","⑧予定時間","⑧サービス提供内容","⑧具体的対応・留意点","⑨予定時間","⑨サービス提供内容","⑨具体的対応・留意点","⑩予定時間","⑩サービス提供内容","⑩具体的対応・留意点","⑪予定時間","⑪サービス提供内容","⑪具体的対応・留意点","⑫予定時間","⑫サービス提供内容","⑫具体的対応・留意点","⑬予定時間","⑬サービス提供内容","⑬具体的対応・留意点","⑭予定時間","⑭サービス提供内容","⑭具体的対応・留意点","⑮予定時間","⑮サービス提供内容","⑮具体的対応・留意点","その他の留意事項","提供時間","報酬区分","利用予定"]
[null,null,null,null,{"$f":"ROW()-6","v":1},"モデル計画","１モデル計画","女","1940-09-15","290-0003","市原市辰巳台東5-7-12","０４３６－７５－２２５１",3,"2014-08-01","2014-09-01","2016-08-31",1000000000,"市原市","介護サポート辰巳","菊池きよの","2015-03-01","瀬尾幸一","このまま家で暮らしたい","住み慣れた家で暮らしていけるようにしたい","・貴重品の持ち込みはなるべくご遠慮ください\n・交通事情により送迎時間が前後する場合があります\n・契約書記載のとおり、行事食、外出行事を行っております。その都度ご案内いたしますが、参加時に実費を頂く場合もあります","①閉じこもり防止のためにも外出の機会を増やしたい\n②今より病気が悪くならないようにしたい\n③清潔な状態が維持できるように支援してほしい\n④歩行を安定させたい","①外出機会を増やす\n②病状を安定させ、元気に暮らせる\n③身体を清潔に保つ\n④転倒しないで生活したい","①家以外での生活を楽しむ\n②定期的な受診と服薬ができる\n③定期的に入浴する\n④下肢筋力向上を図る","・週3回のデイサービスの参加\n・居心地のよい場所になるような働きかけ\n・体感・視覚を刺激するレクの提供","・本人の様子を見ながら、声掛け、介助の仕方の工夫\n・レクや他利用者の輪に入れるように誘導する\n・創作活動などに誘導","平成26年12月","・週3回休まず通所できている\n・他利用者との触れ合いを楽しみにしており、笑顔が見られる。　継続","・カロリー制限食の提供\n・食後の確実な服薬\n・血圧の変動・体調管理","・食事量のチェック\n・食事中の見守り・誘導\n・異常時の早期発見","平成26年12月","・服薬が確実にできている\n・認知症の進行により、食事への認識が弱い時あり。　継続","・安全に入浴ができるように配慮する\n・手の届く所の洗身への働きかけ\n・拒否なく入浴できるような声かけ","・入浴前の血圧チェック\n・スポンジに石けんをつけ、手渡し・声かけ・誘導","平成26年12月","・拒否なくスムーズに入浴ができている　3回／週入浴。\n・手の届く所は洗うが力が弱く、洗い直しが多い。　継続","・個別機能訓練\n・安全に移動できるように配慮\n・集団での体操への参加","・機能訓練計画に従い実施\n・手引きで本人に合わせゆっくりと声かけ・誘導\n・室内の移動が多くなり、歩行回数が増えるように誘導","平成26年12月","・デイ参加時転倒なし。\n・誘導により歩行回数増加。　継続","9：15","迎え","自宅前に9：15到着予定。\n転倒の危険があるため、両手引きにて車内誘導。連絡帳・薬・荷物を預かる。","9：30","サービス提供開始","手洗い・うがい。\n席にてお茶。",0.40277777777777773,"健康チェック","看護職員を中心に、血圧・体温・脈拍の測定。\n体調の確認。","10:00:00","ラジオ体操\n個別機能訓練","全員でラジオ体操後、計画票に添ってのリハビリの実施。",0.42708333333333331,"入浴","一般浴にて入浴。転倒の危険があるため、手引き誘導。着脱介助。\n入浴前の血圧測定で170以上の場合は、入浴中止。","12：00","昼食","500㎉／回の昼食提供。\n食後の服薬の確認。","13：00","くつろぎの時間","テレビ・歓談等。\n状況に応じ、ベッドに臥床。",0.58333333333333337,"レクリエーション","予定プログラムによる集団的なレクリェーション。","15：00","おやつ","お茶とお菓子の提供。水分の補給。","15：30","レクリエーション\n個別機能訓練","頭の体操(しりとり、連想ゲーム、漢字ゲーム)歌など。","16：45","サービス終了","トイレ誘導後、手引きで車へ誘導。","17：00","送り","17：15到着予定。\n手引きで玄関まで誘導。家族に荷物を渡し。連絡事項伝達。",0,"",0,0,0,0,0,0,0,"低血糖症状に注意、血圧170以上は入浴禁止。(主治医より指示あり)","7～9時間","通所介護Ⅱ３"," 月  水  金  日 "]
[null,null,null,null,2]
[null,null,null,null,3]
[null,null,null,null,4]
[null,null,null,null,5]
[null,null,null,null,6]
[null,null,null,null,7]
[null,null,null,null,8]
[null,null,null,null,9]
{"$rows_left_out":142}
{"sheet":"マスタ登録","index":3,"n_rows":16,"n_cols":10,"rows_kept":16,"cut":false,"hidden":false,"merged":[[0,2,0,4],[15,3,15,4]]}
[null,null,"マスタ登録画面",null,null,null,null,"※このページは直接入力修正ができます。"]
[]
[null,"番号","性別","記録作成者","介護度","市町村名","居宅介護支援事業所","介護支援専門員","提供時間","報酬区分"]
[null,1,"女","佐藤一郎",5,"市原市","介護サポートたつみ","山田太郎","７～９時間","通所介護Ⅱ３"]
[null,2,"男","　",4,"　","　　","　","４～７時間","通所介護Ⅱ２"]
[null,3,null,"　",3,"　","　　","　","　","予防通所介護１"]
[null,4,null,"　",2,"　","　　","　","　","予防通所介護２"]
[null,5,null,"　",1,"　","　　","　","　","介護予防支援事業"]
[null,6,null,"　","要支援１","　",null,"　","　","　"]
[null,7,null,"　","要支援２","　","　　","　","　","　"]
[null,8,null,"　","自立","　","　　","　","　","　"]
[null,9,null,"　","変更中","　","　　",null,"　","　"]
[null,10,null,"　","未申請","　","　　","　","　"]
[]
[]
{"$rows_left_out":1}