{"text_format":"1","workbook":"xlsx","n_sheets":6,"sheets":["はじめに","名簿シート","チェックシート","計算シート","記録シート","評価シート"],"not_rendered":{"charts":2,"images":0,"macros":1,"external_links":0,"defined_names":3,"comments":0,"pivot_tables":0},"unopened":[],"bounds":{"document_bytes":16777216,"sheet_cells":100000,"rows_first":2000,"rows_last":500,"rows_between":2000,"halvings":0,"cell_chars":16384,"cell_head_chars":4096},"cells_cut":0,"cells_raw":0,"read":"whole","date_system":"1900"}

{"sheet":"はじめに","index":0,"n_rows":35,"n_cols":11,"rows_kept":35,"cut":false,"hidden":false,"merged":[[10,10,11,12]]}
[]
[null,"ストレスチェック　Ｖｅｒ．３　の使い方"]
[]
[null,"この簡易ソフトは、改正労働安全衛生法に定められた指針に従って作成したものです。"]
[null,"このチェックを外注すると、職員一人当たり７～８００円はかかります。"]
[null,"こんなのもったいないので、自分の施設でチェックできるようにして産業医に評価してもらおうと作りました。"]
[]
[null,"試用してみて継続使用を希望される場合は、有償とさせていただきます。"]
[null,"利用料は・・・１施設あたり３０００円とします。（年間）まあ、お気持ちでということで・・・お願いします。"]
[null,"使えたらと言う条件で感謝の気持ちで寄付をする・・・程度で良いですから・・・。",null,null,null,null,null,null,null,null,"lets右クリック！"]
[null,"千葉興業銀行　辰巳台支店　普通５３１８１２１　萬緑苑後援会口　小出浩丸",null,null,null,null,null,null,null,null,"寄付に同意をする"]
[]
[null,"なお、使用にあたっては必ず私にメールかＦＡＸで連絡を願います。（試用期間を除く）"]
[null,"hiromaru@smile.ocn.ne.jp"]
[null,"０４３６－７５－２２５１　ＦＡＸ０４３６－７５－２２５２"]
{"$rows_left_out":21}
{"sheet":"名簿シート","index":1,"n_rows":204,"n_cols":17,"rows_kept":204,"cut":false,"hidden":true,"merged":[[1,14,1,15],[0,14,0,15],[9,1,9,2],[9,5,9,6],[8,1,8,6],[4,1,5,3],[4,4,5,4],[4,5,5,7],[1,9,1,12],[3,15,8,17],[1,1,1,6]]}
[null,"はじめに名簿（氏名・フリガナ・性別）部分を完成させてください！",null,null,null,null,null,null,"フリガナ順にならべなおします.",null,null,null,null,"削除番号","削除対象者",null,"名前と記録の消去"]
[null,"あなたの名前の左横にある番号を下の欄に入力するか、番号を右クリックして下さい。",null,null,null,null,null,null,"整列","名　簿",null,null,null,null,{"$f":"IF(N2=\"\",\"\",VLOOKUP(N2,J4:N204,2))","v":""},null,"削除"]
[]
[null,null,null,null,null,null,null,null,null,"番号","氏名","フリガナ","性別","同意",null,"名前を削除するときは、かならず削除ボタンで消してください。\nまた、名簿の名前の位置を手動で変えたり、上書きしないでください。\n新規追加は名簿の一番下に加え、整列ボタンを押してください。"]
[null,{"$f":"IF(B3=\"\",\"\",VLOOKUP(B3,J4:N204,2))","v":""},null,null,{"$f":"IF(B3=\"\",\"\",VLOOKUP(B3,J4:N204,4))","v":""},{"$f":"IF(OR(B3=\"\",B5=0),\"\",\"←　間違いありませんか？\")","v":""},null,null,null,{"$f":"ROW()-4","v":1}]
[null,null,null,null,null,null,null,null,null,2]
[null,{"$f":"IF(OR(B3=\"\",B5=0),\"\",\"※間違いがありましたら【名簿表】を訂正して下さい。\")","v":""},null,null,null,null,null,null,null,3]
[null,null,null,null,null,null,null,null,null,4]
[null,{"$f":"IF(OR(B3=\"\",B5=0),\"\",\"ストレスチェック検査に\")","v":""},null,null,null,null,null,null,null,5]
[null,{"$f":"IF(OR(B5=\"\",B5=0),\"\",\"同意します\")","v":""},null,null,null,{"$f":"IF(OR(B5=\"\",B5=0),\"\",\"同意しない\")","v":""},null,null,null,6,null,null,null,null,null,null,"名簿以外の記録を消去"]
[null,null,null,null,null,null,null,null,null,7,null,null,null,null,null,null,"初期化"]
[null,null,null,null,null,null,null,null,null,8]
[null,null,null,null,null,null,null,null,null,9,null,null,null,null,null,null,"名簿と記録の消去"]
[null,null,null,null,null,null,null,null,null,10,null,null,null,null,null,null,"完全初期化"]
[null,null,null,null,null,null,null,null,null,11]
{"$rows_left_out":190}
{"sheet":"チェックシート","index":2,"n_rows":48,"n_cols":15,"rows_kept":48,"cut":false,"hidden":true,"merged":[[45,11,45,12],[47,11,48,14],[2,11,2,14],[2,7,2,10]]}
[]
[null,"初期化"]
[null,null,null,"職業性ストレス簡易調査票（簡略版２３項目）",null,null,null,"氏名",null,null,null,{"$f":"IF(名簿シート!B3=\"\",\"\",VLOOKUP(名簿シート!B3,名簿シート!J4:N204,2))","v":""}]
[]
[null,null,"Ａ．あなたの仕事について伺います。もっともあてはまるものを選択（右クリック）してください。"]
[null,null,null,null,null,null,null,null,null,null,null,"そうだ","まあ\nそうだ","やや\nちがう","ちがう"]
[null,null,1,"非常にたくさんの仕事をしなければならない"]
[null,null,2,"時間内に仕事が処理しきれない"]
[null,null,3,"一生懸命働かなければならない"]
[null,null,4,"自分のペースで仕事ができる"]
[null,null,5,"自分で仕事の順番・やり方を決める事ができる"]
[null,null,6,"職場の仕事の方針に自分の意見を反映できる"]
[]
[null,null,"Ｂ．最近１ヶ月間のあなたの状態について伺います。もっともあてはまるものを選択（右クリック）してください。"]
[null,null,null,null,null,null,null,null,null,null,null,"ほとんど\nなかった","ときどき\nあった","しばしば\nあった","ほとんど\nいつも\nあった"]
{"$rows_left_out":34}
{"sheet":"計算シート","index":3,"n_rows":53,"n_cols":99,"rows_kept":53,"cut":false,"hidden":true,"merged":[[9,94,9,95],[42,79,42,80],[15,88,15,91],[6,88,6,91],[30,88,31,91],[30,92,31,92],[21,15,21,16],[22,15,22,16],[23,15,23,16],[24,15,24,16],[25,15,25,16],[28,5,28,6],[29,5,29,6],[7,11,7,12],[6,11,6,12],[6,1,7,8],[1,44,1,45],[1,46,1,67],[1,25,1,29],[1,30,1,31],[1,32,1,33],[1,34,1,38],[1,39,1,43]]}
[null,null,null,null,null,null,null,null,null,null,null,null,null,null,null,null,null,null,null,null,null,1,2,3,4,5,6,7,8,9,10,11,12,13,14,15,16,17,18,19,20,21,22,23,24,25,26,27,28,29,30,31,32,33,34,35,36,37,38,39,40,41,42,43,44,45,46,47,48,49]
[null,null,null,null,null,null,null,null,null,null,null,null,null,null,null,null,null,null,null,null,null,"基本情報",null,null,null,"【心身のストレス反応に関する項目】",null,null,null,null,"【仕事のストレスの要因に関する項目】",null,"【周囲のサポートに関する項目】",null,"評価基準１による計算",null,null,null,null,"評価基準２による計算",null,null,null,null,"判定",null,"入力内容"]
[null,null,null,null,null,null,null,null,null,null,null,null,null,null,null,null,null,null,null,null,null,"番号","氏名","フリガナ","日付","疲労感","不安感","抑うつ感","食欲不振","不眠","心理的な仕事の負担","仕事のコントロール度","上司からのサポート","同僚からのサポート","Ａ","Ｂ","Ｃ","Ｂ＋Ｃ","Ａ＋Ｂ＋Ｃ","Ａ","Ｂ","Ｃ","Ｂ＋Ｃ","Ａ＋Ｂ＋Ｃ",{"$f":"B29","v":"評価基準１による判定"},{"$f":"B30","v":"評価基準２による判定"},"性別","非常にたくさんの仕事をしなければならない","時間内に仕事が処理しきれない","一生懸命働かなければならない","自分のペースで仕事ができる","自分で仕事の順番・やり方を決める事ができる","職場の仕事の砲身に自分の意見を反映できる","ひどく疲れた","へとへとだ","だるい","気がはりつめている","不安だ","落ち着かない","ゆううつだ","何をするのも面倒だ","気分が晴れない","食欲がない","よく眠れない","上司","職場の同僚","上司","職場の同僚","上司","職場の同僚"]
[null,null,null,null,null,null,null,null,null,null,null,null,null,null,null,null,null,null,null,null,null,{"$f":"名簿シート!$B$3","v":0},{"$f":"$L$8","v":""},{"$f":"VLOOKUP($V$4,名簿シート!$J$4:$N$204,3)","v":{"$error":"#N/A"}},{"$f":"$L$7","v":"2016-09-14T00:23:41.930"},{"$f":"$W$10","v":{"$error":"#N/A"}},{"$f":"$W$11","v":{"$error":"#N/A"}},{"$f":"$W$12","v":{"$error":"#N/A"}},{"$f":"$W$13","v":{"$error":"#N/A"}},{"$f":"$W$14","v":{"$error":"#N/A"}},{"$f":"$W$18","v":{"$error":"#N/A"}},{"$f":"$W$19","v":{"$error":"#N/A"}},{"$f":"$W$20","v":{"$error":"#N/A"}},{"$f":"$W$21","v":{"$error":"#N/A"}},{"$f":"$L$11","v":0},{"$f":"$L$12","v":0},{"$f":"$L$13","v":0},{"$f":"$L$14","v":0},{"$f":"$L$15","v":0},{"$f":"$L$20","v":{"$error":"#N/A"}},{"$f":"$L$21","v":{"$error":"#N/A"}},{"$f":"$L$22","v":{"$error":"#N/A"}},{"$f":"$L$23","v":{"$error":"#N/A"}},{"$f":"$L$24","v":{"$error":"#N/A"}},{"$f":"$F$29","v":"-"},{"$f":"$F$30","v":{"$error":"#N/A"}},{"$f":"計算シート!$CB$6","v":{"$error":"#N/A"}},{"$f":"計算シート!$BT$8","v":0},{"$f":"計算シート!$BT$9","v":0},{"$f":"計算シート!$BT$10","v":0},{"$f":"計算シート!$BT$11","v":0},{"$f":"計算シート!$BT$12","v":0},{"$f":"計算シート!$BT$13","v":0},{"$f":"計算シート!$BT$17","v":0},{"$f":"計算シート!$BT$18","v":0},{"$f":"計算シート!$BT$19","v":0},{"$f":"計算シート!$BT$20","v":0},{"$f":"計算シート!$BT$21","v":0},{"$f":"計算シート!$BT$22","v":0},{"$f":"計算シート!$BT$23","v":0},{"$f":"計算シート!$BT$24","v":0},{"$f":"計算シート!$BT$25","v":0},{"$f":"計算シート!$BT$26","v":0},{"$f":"計算シート!$BT$27","v":0},{"$f":"計算シート!$BT$33","v":0},{"$f":"計算シート!BT34","v":0},{"$f":"計算シート!BT38","v":0},{"$f":"計算シート!BT39","v":0},{"$f":"計算シート!BT43","v":0},{"$f":"計算シート!BT44","v":0}]
[null,null,null,null,null,null,null,null,null,null,null,null,null,null,null,null,null,null,null,null,null,null,null,null,null,null,null,null,null,null,null,null,null,null,null,null,null,null,null,null,null,null,null,null,null,null,null,null,null,null,null,null,null,null,null,null,null,null,null,null,null,null,null,null,null,null,null,null,null,null,null,null,null,null,null,null,null,null,null,null,null,null,"評価基準２による配点"]
[null,null,null,null,null,null,null,null,null,null,null,null,null,null,null,null,null,null,null,null,null,null,null,null,null,null,null,null,null,null,null,null,null,null,null,null,null,null,null,null,null,null,null,null,null,null,null,null,null,null,null,null,null,null,null,null,null,null,null,null,null,null,null,null,null,null,null,null,null,null,null,null,null,null,null,null,null,null,"性別",{"$f":"VLOOKUP(名簿シート!B3,名簿シート!J4:N204,4)","v":{"$error":"#N/A"}},null,null,5,4,3,2,1,null,"評価基準１による配点",null,null,null,{"$f":"CK7","v":"【仕事のストレス要因】"},null,null,{"$f":"CK31","v":"【周囲からのサポート】"}]
[null,"ストレスチェックの結果通知書",null,null,null,null,null,null,null,null,null,{"$f":"NOW()","v":"2016-09-14T00:23:41.930"},null,null,{"$f":"評価シート!B10","v":"【心身に感じている負担感・ストレス】"},null,null,null,null,null,null,null,null,null,null,null,null,null,null,null,null,null,null,null,null,null,null,null,null,null,null,null,null,null,null,null,null,null,null,null,null,null,null,null,null,null,null,null,null,null,null,null,null,null,null,null,null,null,null,null,null,null,"枝番号",null,"【ストレスの原因と考えられる因子】",null,null,null,null,null,null,null,"低い／\n少ない","やや低い\n／少ない","普通","やや高い\n／多い","高い／\n多い",null,"【仕事のストレス要因】",null,null,null,"採点",{"$f":"SUM(CO8:CO13)","v":0},"＋",{"$f":"SUM(CO33:CO44)","v":0},"＝",{"$f":"CP7+CR7","v":0},"合計３９点以上であり、かつ心身のストレス反応が２３点以上は高ストレス"]
[null,null,null,null,null,null,null,null,null,null,"氏名",{"$f":"チェックシート!L3","v":""},null,null,null,"あなたの評価","職員平均","最大値","コメント",null,null,null,null,null,null,null,null,null,null,null,null,null,null,null,"評価",null,null,null,null,null,null,null,null,null,null,null,null,null,null,null,null,null,null,null,null,null,null,null,null,null,null,null,null,null,null,null,null,null,null,null,null,{"$f":"IF(チェックシート!L7=\"〇\",1,IF(チェックシート!M7=\"〇\",2,IF(チェックシート!N7=\"〇\",3,IF(チェックシート!O7=\"〇\",4,0))))","v":0},1,null,"心理的な仕事の負担",null,"判定",null,"男","女",null,"男","ー",6,8,10,12,null,4,3,2,1,{"$f":"IF(チェックシート!L7=\"〇\",CK8,IF(チェックシート!M7=\"〇\",CL8,IF(チェックシート!N7=\"〇\",CM8,IF(チェックシート!O7=\"〇\",CN8,0))))","v":0}]
[null,null,null,null,null,null,null,null,null,null,null,null,null,null,{"$f":"評価シート!B11","v":"疲労感"},{"$f":"IF(評価シート!$B$3=\"\",\"\",6-VLOOKUP(評価シート!$B$3,記録シート!$B$5:$AV$205,5))","v":6},{"$f":"記録シート!F1","v":0},5,{"$f":"IF(P9>=4,O9,\"\")","v":"疲労感"},{"$f":"IF(S9=\"\",\"\",IF(COUNTBLANK(S10:S20)=11,\"に\",\"と\"))","v":"と"},null,{"$f":"B10","v":"【心身のストレス反応に関する項目】"},"あなたの評価","職員平均",null,null,null,null,null,null,null,null,null,null,{"$f":"IF(評価シート!$B$3=\"\",\"\",VLOOKUP(評価シート!$B$3,記録シート!$B$5:$AW$205,27))","v":0},null,null,null,null,null,null,null,null,null,null,null,null,null,null,null,null,null,null,null,null,null,null,null,null,null,null,null,null,null,null,null,null,null,null,null,null,{"$f":"IF(チェックシート!L8=\"〇\",1,IF(チェックシート!M8=\"〇\",2,IF(チェックシート!N8=\"〇\",3,IF(チェックシート!O8=\"〇\",4,0))))","v":0},2,null,{"$f":"15-SUM(BT8:BT10)","v":15},null,{"$f":"IF($CB$6=\"男\",CA9,CB9)","v":{"$error":"#N/A"}},null,{"$f":"IF(BW9>=CI8,1,IF(BW9>=CH8,2,IF(BW9>=CG8,3,IF(BW9>=CF8,4,5))))","v":1},{"$f":"IF(BW9>=CI9,1,IF(BW9>=CH9,2,IF(BW9>=CG9,3,IF(BW9>=CF9,4,5))))","v":1},null,"女","ー",5,7,10,12,null,4,3,2,1,{"$f":"IF(チェックシート!L8=\"〇\",CK9,IF(チェックシート!M8=\"〇\",CL9,IF(チェックシート!N8=\"〇\",CM9,IF(チェックシート!O8=\"〇\",CN9,0))))","v":0},null,"評価基準１による判定"]
[null,"【心身のストレス反応に関する項目】",null,null,null,"ストレス",null,"評価基準１による計算",null,null,null,null,null,null,{"$f":"評価シート!B12","v":"不安感"},{"$f":"IF(評価シート!$B$3=\"\",\"\",6-VLOOKUP(評価シート!$B$3,記録シート!$B$5:$AV$205,6))","v":6},{"$f":"記録シート!G1","v":0},5,{"$f":"IF(P10>=4,O10,\"\")","v":"不安感"},{"$f":"IF(S10=\"\",\"\",IF(COUNTBLANK(S11:S20)=10,\"に\",\"と\"))","v":"と"},null,"疲労感",{"$f":"計算シート!BY18","v":{"$error":"#N/A"}},3,null,null,null,null,null,null,null,null,null,null,{"$f":"IF(評価シート!$B$3=\"\",\"\",VLOOKUP(評価シート!$B$3,記録シート!$B$5:$AW$205,28))","v":0},null,null,null,null,null,null,null,null,null,null,null,null,null,null,null,null,null,null,null,null,null,null,null,null,null,null,null,null,null,null,null,null,null,null,null,null,{"$f":"IF(チェックシート!L9=\"〇\",1,IF(チェックシート!M9=\"〇\",2,IF(チェックシート!N9=\"〇\",3,IF(チェックシート!O9=\"〇\",4,0))))","v":0},3,null,"仕事のコントロール度",null,"判定",null,"男","女",null,"男",4,6,8,10,"ー",null,4,3,2,1,{"$f":"IF(チェックシート!L9=\"〇\",CK10,IF(チェックシート!M9=\"〇\",CL10,IF(チェックシート!N9=\"〇\",CM10,IF(チェックシート!O9=\"〇\",CN10,0))))","v":0},null,{"$f":"IF(CP16>=31,\"高ストレス状態\",IF(AND(CT7>=39,CP16>=23),\"高ストレス状態\",\"-\"))","v":"-"}]
[null,"疲労感",null,null,null,{"$f":"VLOOKUP(計算シート!BY18,K49:L53,2)","v":{"$error":"#N/A"}},null,"Ａ","【心身のストレス反応】",null,null,{"$f":"計算シート!CP16","v":0},"点",null,{"$f":"評価シート!B13","v":"抑うつ感"},{"$f":"IF(評価シート!$B$3=\"\",\"\",6-VLOOKUP(評価シート!$B$3,記録シート!$B$5:$AV$205,7))","v":6},{"$f":"記録シート!H1","v":0},5,"抑うつ感",{"$f":"IF(S11=\"\",\"\",IF(COUNTBLANK(S12:S20)=9,\"に\",\"と\"))","v":"と"},null,"不安感",{"$f":"計算シート!BY20","v":{"$error":"#N/A"}},3,null,null,null,null,null,null,null,null,null,null,{"$f":"IF(評価シート!$B$3=\"\",\"\",VLOOKUP(評価シート!$B$3,記録シート!$B$5:$AW$205,29))","v":0},null,null,null,null,null,null,null,null,null,null,null,null,null,null,null,null,null,null,null,null,null,null,null,null,null,null,null,null,null,null,null,null,null,null,null,null,{"$f":"IF(チェックシート!L10=\"〇\",1,IF(チェックシート!M10=\"〇\",2,IF(チェックシート!N10=\"〇\",3,IF(チェックシート!O10=\"〇\",4,0))))","v":0},8,null,{"$f":"15-SUM(BT11:BT13)","v":15},null,{"$f":"IF($CB$6=\"男\",CA11,CB11)","v":{"$error":"#N/A"}},null,{"$f":"IF(BW11<=CE10,1,IF(BW11<=CF10,2,IF(BW11<=CG10,3,IF(BW11<=CH10,4,5))))","v":5},{"$f":"IF(BW11<=CE11,1,IF(BW11<=CF11,2,IF(BW11<=CG11,3,IF(BW11<=CH11,4,5))))","v":5},null,"女",3,5,8,10,"ー",null,1,2,3,4,{"$f":"IF(チェックシート!L10=\"〇\",CK11,IF(チェックシート!M10=\"〇\",CL11,IF(チェックシート!N10=\"〇\",CM11,IF(チェックシート!O10=\"〇\",CN11,0))))","v":0}]
[null,"不安感",null,null,null,{"$f":"VLOOKUP(計算シート!BY20,K49:L53,2)","v":{"$error":"#N/A"}},null,"Ｂ","【仕事のストレス要因】",null,null,{"$f":"計算シート!CP7","v":0},"点",null,{"$f":"評価シート!B14","v":"食欲不振"},{"$f":"IF(評価シート!$B$3=\"\",\"\",6-VLOOKUP(評価シート!$B$3,記録シート!$B$5:$AV$205,8))","v":6},{"$f":"記録シート!I1","v":0},5,"食欲不振",{"$f":"IF(S12=\"\",\"\",IF(COUNTBLANK(S13:S20)=8,\"に\",\"と\"))","v":"と"},null,"抑うつ感",{"$f":"計算シート!BY22","v":{"$error":"#N/A"}},3,null,null,null,null,null,null,null,null,null,null,{"$f":"IF(評価シート!$B$3=\"\",\"\",VLOOKUP(評価シート!$B$3,記録シート!$B$5:$AW$205,30))","v":0},null,null,null,null,null,null,null,null,null,null,null,null,null,null,null,null,null,null,null,null,null,null,null,null,null,null,null,null,null,null,null,null,null,null,null,null,{"$f":"IF(チェックシート!L11=\"〇\",1,IF(チェックシート!M11=\"〇\",2,IF(チェックシート!N11=\"〇\",3,IF(チェックシート!O11=\"〇\",4,0))))","v":0},9,null,null,null,null,null,null,null,null,null,null,null,null,null,null,null,1,2,3,4,{"$f":"IF(チェックシート!L11=\"〇\",CK12,IF(チェックシート!M11=\"〇\",CL12,IF(チェックシート!N11=\"〇\",CM12,IF(チェックシート!O11=\"〇\",CN12,0))))","v":0}]
[null,"抑うつ感",null,null,null,{"$f":"VLOOKUP(計算シート!BY22,K49:L53,2)","v":{"$error":"#N/A"}},null,"Ｃ","【周囲からのサポート】",null,null,{"$f":"計算シート!CR7","v":0},"点",null,{"$f":"評価シート!B15","v":"不眠"},{"$f":"IF(評価シート!$B$3=\"\",\"\",6-VLOOKUP(評価シート!$B$3,記録シート!$B$5:$AV$205,9))","v":6},{"$f":"記録シート!J1","v":0},5,"不眠",{"$f":"IF(S13=\"\",\"\",IF(COUNTBLANK(S14:S20)=7,\"に\",\"と\"))","v":"と"},null,"食欲不振",{"$f":"計算シート!BY24","v":{"$error":"#N/A"}},3,null,null,null,null,null,null,null,null,null,null,{"$f":"IF(評価シート!$B$3=\"\",\"\",VLOOKUP(評価シート!$B$3,記録シート!$B$5:$AW$205,31))","v":0},null,null,null,null,null,null,null,null,null,null,null,null,null,null,null,null,null,null,null,null,null,null,null,null,null,null,null,null,null,null,null,null,null,null,null,null,{"$f":"IF(チェックシート!L12=\"〇\",1,IF(チェックシート!M12=\"〇\",2,IF(チェックシート!N12=\"〇\",3,IF(チェックシート!O12=\"〇\",4,0))))","v":0},10,null,null,null,null,null,null,null,null,null,null,null,null,null,null,null,1,2,3,4,{"$f":"IF(チェックシート!L12=\"〇\",CK13,IF(チェックシート!M12=\"〇\",CL13,IF(チェックシート!N12=\"〇\",CM13,IF(チェックシート!O12=\"〇\",CN13,0))))","v":0}]
[null,"食欲不振",null,null,null,{"$f":"VLOOKUP(計算シート!BY24,K49:L53,2)","v":{"$error":"#N/A"}},null,null,"Ｂ＋Ｃ",null,null,{"$f":"L12+L13","v":0},"点",null,null,null,null,null,null,null,null,"不眠",{"$f":"計算シート!BY26","v":{"$error":"#N/A"}},3,null,null,null,null,null,null,null,null,null,null,{"$f":"IF(評価シート!$B$3=\"\",\"\",VLOOKUP(評価シート!$B$3,記録シート!$B$5:$AW$205,32))","v":0},null,null,null,null,null,null,null,null,null,null,null,null,null,null,null,null,null,null,null,null,null,null,null,null,null,null,null,null,null,null,null,null,null,null,null,null,{"$f":"PRODUCT(BT8:BT13)","v":0},"入力判定"]
[null,"不眠",null,null,null,{"$f":"VLOOKUP(計算シート!BY26,K49:L53,2)","v":{"$error":"#N/A"}},null,null,"Ａ＋Ｂ＋Ｃ",null,null,{"$f":"SUM(L11:L13)","v":0},"点",null,{"$f":"評価シート!B18","v":"【仕事において感じる負担感・ストレス】"},null,null,null,null,null,null,null,null,null,null,null,null,null,null,null,null,null,null,null,null,null,null,null,null,null,null,null,null,null,null,null,null,null,null,null,null,null,null,null,null,null,null,null,null,null,null,null,null,null,null,null,null,null,null,null,null,null,null,null,null,null,null,null,null,null,null,null,null,null,null,null,null,null,null,null,null,null,null,{"$f":"CK16","v":"【心身のストレス反応】"}]
{"$rows_left_out":39}
{"sheet":"記録シート","index":4,"n_rows":205,"n_cols":50,"rows_kept":205,"cut":false,"hidden":true,"merged":[[2,1,2,4],[2,26,2,49],[2,24,2,25],[2,5,2,9],[2,10,2,11],[2,12,2,13],[2,14,2,18],[2,19,2,23]]}
["初期化",null,null,null,null,{"$f":"IF(SUM(F6:F205)=0,0,6-AVERAGE(F6:F205))","v":0},0,0,0,0,0,0,0,0]
[null,1,2,3,4,5,6,7,8,9,10,11,12,13,14,15,16,17,18,19,20,21,22,23,24,25,26,27,28,29,30,31,32,33,34,35,36,37,38,39,40,41,42,43,44,45,46,47,48,49]
[null,"基本情報",null,null,null,"【心身のストレス反応に関する項目】",null,null,null,null,"【仕事のストレスの要因に関する項目】",null,"【周囲のサポートに関する項目】",null,"評価基準１による計算",null,null,null,null,"評価基準２による計算",null,null,null,null,"判定",null,"入　　力　　内　　容"]
[]
[null,"番号","氏名","フリガナ","日付","疲労感","不安感","抑うつ感","食欲不振","不眠","心理的な仕事の負担","仕事のコントロール度","上司からのサポート","同僚からのサポート","Ａ","Ｂ","Ｃ","Ｂ＋Ｃ","Ａ＋Ｂ＋Ｃ","Ａ","Ｂ","Ｃ","Ｂ＋Ｃ","Ａ＋Ｂ＋Ｃ","評価１","評価２","性別","非常にたくさんの仕事をしなければならない","時間内に仕事が処理しきれない","一生懸命働かなければならない","自分のペースで仕事ができる","自分で仕事の順番・やり方を決める事ができる","職場の仕事の砲身に自分の意見を反映できる","ひどく疲れた","へとへとだ","だるい","気がはりつめている","不安だ","落ち着かない","ゆううつだ","何をするのも面倒だ","気分が晴れない","食欲がない","よく眠れない","上司","職場の同僚","上司","職場の同僚","上司","職場の同僚"]
[null,{"$f":"ROW()-5","v":1}]
[null,2]
[null,3]
[null,4]
[null,5]
[null,6]
[null,7]
[null,8]
[null,9]
[null,10]
{"$rows_left_out":191}
{"sheet":"評価シート","index":5,"n_rows":51,"n_cols":34,"rows_kept":51,"cut":false,"hidden":true,"merged":[[33,1,36,12],[19,32,20,32],[19,33,20,33],[14,4,14,5],[18,4,18,5],[19,4,19,5],[19,30,20,30],[46,11,46,12],[41,1,42,12],[44,1,45,12],[19,31,20,31],[2,2,2,3],[13,4,13,5],[28,5,28,6],[29,5,29,6],[23,4,23,5],[24,4,24,5],[6,11,6,12],[7,18,7,19],[7,11,7,12],[8,14,9,19],[7,30,7,33],[39,1,39,12],[1,2,1,3],[10,4,10,5],[11,4,11,5],[12,4,12,5],[6,1,7,8],[9,30,10,30],[9,31,10,31],[7,26,7,29],[6,31,6,33],[9,32,10,32],[9,33,10,33]]}
[]
[null,null,"対象者"]
[null,1,{"$f":"IF($B$3=\"\",\"\",VLOOKUP($B$3,記録シート!$B$5:$AV$205,2))","v":0},null,"単票印刷",null,null,null,null,"～",null,null,"連続印刷",null,"全シート表示",null,"隠す"]
[]
[]
[]
[null,"ストレスチェックの結果通知書",null,null,null,null,null,null,null,null,null,null,null,null,null,null,null,null,null,null,null,null,"職業性ストレス簡易調査票（簡略版２３項目）",null,null,null,null,null,null,"実施日",null,{"$f":"IF(B3=\"\",\"\",VLOOKUP(B3,記録シート!B5:AX205,4))","v":"00:00:00"}]
[null,null,null,null,null,null,null,null,null,null,"氏名",{"$f":"IF($B$3=\"\",\"\",VLOOKUP($B$3,記録シート!$B$5:$AV$205,2))","v":0},null,null,null,null,null,"氏名",{"$f":"L8","v":0},null,null,null,null,null,null,null,"氏名",null,null,null,{"$f":"L8","v":0}]
[null,null,null,null,null,null,null,null,null,null,null,null,null,null,"あなたのストレスプロフィール",null,null,null,null,null,null,"Ａ．あなたの仕事について伺います。もっともあてはまるものを選択してください。"]
[null,"【心身に感じている負担感・ストレス】",null,null,null,null,null,"評価基準１による計算",null,null,null,null,null,null,null,null,null,null,null,null,null,null,null,null,null,null,null,null,null,null,"そうだ","まあ\nそうだ","やや\nちがう","ちがう"]
[null,"疲労感",null,null,{"$f":"IF($B$3=\"\",\"\",VLOOKUP(VLOOKUP($B$3,記録シート!$B$5:$AV$205,5),計算シート!O22:P26,2))","v":{"$error":"#N/A"}},null,null,"Ａ","【心身のストレス反応】",null,null,{"$f":"IF($B$3=\"\",\"\",VLOOKUP($B$3,記録シート!$B$5:$AV$205,14))","v":0},"点"]
[null,"不安感",null,null,{"$f":"IF($B$3=\"\",\"\",VLOOKUP(VLOOKUP($B$3,記録シート!$B$5:$AV$205,6),計算シート!O22:P26,2))","v":{"$error":"#N/A"}},null,null,"Ｂ","【仕事のストレス要因】",null,null,{"$f":"IF($B$3=\"\",\"\",VLOOKUP($B$3,記録シート!$B$5:$AV$205,15))","v":0},"点",null,"【心身に感じている負担感・ストレス】",null,null,null,null,null,null,1,"非常にたくさんの仕事をしなければならない",null,null,null,null,null,null,null,{"$f":"IF(計算シート!AI9=1,\"〇\",\"\")","v":""},{"$f":"IF(計算シート!AI9=2,\"〇\",\"\")","v":""},{"$f":"IF(計算シート!AI9=3,\"〇\",\"\")","v":""},{"$f":"IF(計算シート!AI9=4,\"〇\",\"\")","v":""}]
[null,"抑うつ感",null,null,{"$f":"IF($B$3=\"\",\"\",VLOOKUP(VLOOKUP($B$3,記録シート!$B$5:$AV$205,7),計算シート!O22:P26,2))","v":{"$error":"#N/A"}},null,null,"Ｃ","【周囲からのサポート】",null,null,{"$f":"IF($B$3=\"\",\"\",VLOOKUP($B$3,記録シート!$B$5:$AV$205,16))","v":0},"点",null,null,null,null,null,null,null,null,2,"時間内に仕事が処理しきれない",null,null,null,null,null,null,null,{"$f":"IF(計算シート!AI10=1,\"〇\",\"\")","v":""},{"$f":"IF(計算シート!AI10=2,\"〇\",\"\")","v":""},{"$f":"IF(計算シート!AI10=3,\"〇\",\"\")","v":""},{"$f":"IF(計算シート!AI10=4,\"〇\",\"\")","v":""}]
[null,"食欲不振",null,null,{"$f":"IF($B$3=\"\",\"\",VLOOKUP(VLOOKUP($B$3,記録シート!$B$5:$AV$205,8),計算シート!O22:P26,2))","v":{"$error":"#N/A"}},null,null,null,"Ｂ＋Ｃ",null,null,{"$f":"IF($B$3=\"\",\"\",VLOOKUP($B$3,記録シート!$B$5:$AV$205,17))","v":0},"点",null,null,null,null,null,null,null,null,3,"一生懸命働かなければならない",null,null,null,null,null,null,null,{"$f":"IF(計算シート!AI11=1,\"〇\",\"\")","v":""},{"$f":"IF(計算シート!AI11=2,\"〇\",\"\")","v":""},{"$f":"IF(計算シート!AI11=3,\"〇\",\"\")","v":""},{"$f":"IF(計算シート!AI11=4,\"〇\",\"\")","v":""}]
[null,"不眠",null,null,{"$f":"IF($B$3=\"\",\"\",VLOOKUP(VLOOKUP($B$3,記録シート!$B$5:$AV$205,9),計算シート!O22:P26,2))","v":{"$error":"#N/A"}},null,null,null,"Ａ＋Ｂ＋Ｃ",null,null,{"$f":"IF($B$3=\"\",\"\",VLOOKUP($B$3,記録シート!$B$5:$AV$205,18))","v":0},"点",null,null,null,null,null,null,null,null,4,"自分のペースで仕事ができる",null,null,null,null,null,null,null,{"$f":"IF(計算シート!AI12=1,\"〇\",\"\")","v":""},{"$f":"IF(計算シート!AI12=2,\"〇\",\"\")","v":""},{"$f":"IF(計算シート!AI12=3,\"〇\",\"\")","v":""},{"$f":"IF(計算シート!AI12=4,\"〇\",\"\")","v":""}]
{"$rows_left_out":36}