{"text_format":"1","workbook":"xlsx","n_sheets":7,"sheets":["説明書","残高表","選択表","入力表","記録表","条件表","抽出表"],"not_rendered":{"charts":0,"images":0,"macros":1,"external_links":0,"defined_names":3,"comments":0,"pivot_tables":0},"unopened":[],"bounds":{"document_bytes":16777216,"sheet_cells":100000,"rows_first":2000,"rows_last":500,"rows_between":2000,"halvings":0,"cell_chars":16384,"cell_head_chars":4096},"cells_cut":0,"cells_raw":0,"read":"whole","date_system":"1900"}

{"sheet":"説明書","index":0,"n_rows":141,"n_cols":12,"rows_kept":141,"cut":false,"hidden":false,"merged":[[139,8,139,10],[14,4,14,5],[13,8,13,9],[13,11,13,12]]}
[]
[null,null,"【金銭管理Ver.２】　の使用方法"]
[]
[null,null,"特に注意すべきところ！"]
[null,null,"１．シートの保護はむやみに解除しないでください。"]
[null,null,"２．ドラック＆ドロップ、切り取り、行や列やセルの挿入あるいは削除、列や行全体のクリアは厳禁です。"]
[null,null,"３．文字の大きさの変更をするとマクロが作動しなくなることがあります。"]
[null,null,"※どうしても変更が必要な場合は、いったん保存し、開発者に意見を聞いてから行ってください。"]
[]
[]
[null,null,"【説明表】","取扱説明書です。"]
[]
[null,null,"このエクセルプログラムは以下の７枚のシートから構成されています。"]
[null,null,null,"【説明表】",null,null,"【選択表】",null,"【記録表】",null,null,"【抽出表】"]
[null,null,null,null,"【残高表】",null,null,"【入力表】",null,null,"【条件表】"]
[null,null,"シートの様々なところには、入力などを補助する仕組み（マクロプログラム）が隠されています。"]
[null,null,"その発動は、マウスの右クリックとＷクリックによって生じます。"]
[null,null,"詳細については各シートごとに説明します。"]
[]
[]
{"$rows_left_out":122}
{"sheet":"残高表","index":1,"n_rows":205,"n_cols":26,"rows_kept":205,"cut":false,"hidden":false,"merged":[]}
[1,2,3,4,5,6,7,8,9,10,11,12,13,14,15,16,17,18,19,20,21]
[null,"※優先右クリックで○＝優先表示",null,null,null,null,null,null,null,null,null,"圧縮"]
[null,"※コード右クリックで金融機関選定",null,null,"名簿作成",null,"利用者残高一覧表",null,null,null,null,"再計算",null,null,null,null,null,null,null,null,null,null,null,null,"金融機関マスタ"]
[]
[null,"優先","番号","お名前","フリガナ","コード","金融機関","口座番号","残額","コード","金融機関","口座番号","残額","コード","金融機関","口座番号","残額","コード","金融機関","口座番号","残額","合計","記録表計",null,"番号","金融機関名"]
[null,null,1,null,null,null,{"$f":"IF(F6=\"\",\"\",VLOOKUP(F6,残高表!$Y$5:$Z$20,2))","v":""},null,null,null,{"$f":"IF(J6=\"\",\"\",VLOOKUP(J6,残高表!$Y$5:$Z$20,2))","v":""},null,null,null,{"$f":"IF(N6=\"\",\"\",VLOOKUP(N6,残高表!$Y$5:$Z$20,2))","v":""},null,null,null,{"$f":"IF(R6=\"\",\"\",VLOOKUP(R6,残高表!$Y$5:$Z$20,2))","v":""},null,null,null,null,null,1,"千葉興業銀行辰巳台支店"]
[null,null,2,null,null,null,{"$f":"IF(F7=\"\",\"\",VLOOKUP(F7,残高表!$Y$5:$Z$20,2))","v":""},null,null,null,{"$f":"IF(J7=\"\",\"\",VLOOKUP(J7,残高表!$Y$5:$Z$20,2))","v":""},null,null,null,{"$f":"IF(N7=\"\",\"\",VLOOKUP(N7,残高表!$Y$5:$Z$20,2))","v":""},null,null,null,{"$f":"IF(R7=\"\",\"\",VLOOKUP(R7,残高表!$Y$5:$Z$20,2))","v":""},null,null,null,null,null,2,"千葉興業銀行　定期預金"]
[null,null,3,null,null,null,{"$f":"IF(F8=\"\",\"\",VLOOKUP(F8,残高表!$Y$5:$Z$20,2))","v":""},null,null,null,{"$f":"IF(J8=\"\",\"\",VLOOKUP(J8,残高表!$Y$5:$Z$20,2))","v":""},null,null,null,{"$f":"IF(N8=\"\",\"\",VLOOKUP(N8,残高表!$Y$5:$Z$20,2))","v":""},null,null,null,{"$f":"IF(R8=\"\",\"\",VLOOKUP(R8,残高表!$Y$5:$Z$20,2))","v":""},null,null,null,null,null,3,"郵便局"]
[null,null,4,null,null,null,{"$f":"IF(F9=\"\",\"\",VLOOKUP(F9,残高表!$Y$5:$Z$20,2))","v":""},null,null,null,{"$f":"IF(J9=\"\",\"\",VLOOKUP(J9,残高表!$Y$5:$Z$20,2))","v":""},null,null,null,{"$f":"IF(N9=\"\",\"\",VLOOKUP(N9,残高表!$Y$5:$Z$20,2))","v":""},null,null,null,{"$f":"IF(R9=\"\",\"\",VLOOKUP(R9,残高表!$Y$5:$Z$20,2))","v":""},null,null,null,null,null,4,"郵便局　定期預金"]
[null,null,5,null,null,null,{"$f":"IF(F10=\"\",\"\",VLOOKUP(F10,残高表!$Y$5:$Z$20,2))","v":""},null,null,null,{"$f":"IF(J10=\"\",\"\",VLOOKUP(J10,残高表!$Y$5:$Z$20,2))","v":""},null,null,null,{"$f":"IF(N10=\"\",\"\",VLOOKUP(N10,残高表!$Y$5:$Z$20,2))","v":""},null,null,null,{"$f":"IF(R10=\"\",\"\",VLOOKUP(R10,残高表!$Y$5:$Z$20,2))","v":""},null,null,null,null,null,5,"千葉銀行八幡宿支店"]
[null,null,6,null,null,null,{"$f":"IF(F11=\"\",\"\",VLOOKUP(F11,残高表!$Y$5:$Z$20,2))","v":""},null,null,null,{"$f":"IF(J11=\"\",\"\",VLOOKUP(J11,残高表!$Y$5:$Z$20,2))","v":""},null,null,null,{"$f":"IF(N11=\"\",\"\",VLOOKUP(N11,残高表!$Y$5:$Z$20,2))","v":""},null,null,null,{"$f":"IF(R11=\"\",\"\",VLOOKUP(R11,残高表!$Y$5:$Z$20,2))","v":""},null,null,null,null,null,6]
[null,null,7,null,null,null,{"$f":"IF(F12=\"\",\"\",VLOOKUP(F12,残高表!$Y$5:$Z$20,2))","v":""},null,null,null,{"$f":"IF(J12=\"\",\"\",VLOOKUP(J12,残高表!$Y$5:$Z$20,2))","v":""},null,null,null,{"$f":"IF(N12=\"\",\"\",VLOOKUP(N12,残高表!$Y$5:$Z$20,2))","v":""},null,null,null,{"$f":"IF(R12=\"\",\"\",VLOOKUP(R12,残高表!$Y$5:$Z$20,2))","v":""},null,null,null,null,null,7]
[null,null,8,null,null,null,{"$f":"IF(F13=\"\",\"\",VLOOKUP(F13,残高表!$Y$5:$Z$20,2))","v":""},null,null,null,{"$f":"IF(J13=\"\",\"\",VLOOKUP(J13,残高表!$Y$5:$Z$20,2))","v":""},null,null,null,{"$f":"IF(N13=\"\",\"\",VLOOKUP(N13,残高表!$Y$5:$Z$20,2))","v":""},null,null,null,{"$f":"IF(R13=\"\",\"\",VLOOKUP(R13,残高表!$Y$5:$Z$20,2))","v":""},null,null,null,null,null,8]
[null,null,9,null,null,null,{"$f":"IF(F14=\"\",\"\",VLOOKUP(F14,残高表!$Y$5:$Z$20,2))","v":""},null,null,null,{"$f":"IF(J14=\"\",\"\",VLOOKUP(J14,残高表!$Y$5:$Z$20,2))","v":""},null,null,null,{"$f":"IF(N14=\"\",\"\",VLOOKUP(N14,残高表!$Y$5:$Z$20,2))","v":""},null,null,null,{"$f":"IF(R14=\"\",\"\",VLOOKUP(R14,残高表!$Y$5:$Z$20,2))","v":""},null,null,null,null,null,9]
[null,null,10,null,null,null,{"$f":"IF(F15=\"\",\"\",VLOOKUP(F15,残高表!$Y$5:$Z$20,2))","v":""},null,null,null,{"$f":"IF(J15=\"\",\"\",VLOOKUP(J15,残高表!$Y$5:$Z$20,2))","v":""},null,null,null,{"$f":"IF(N15=\"\",\"\",VLOOKUP(N15,残高表!$Y$5:$Z$20,2))","v":""},null,null,null,{"$f":"IF(R15=\"\",\"\",VLOOKUP(R15,残高表!$Y$5:$Z$20,2))","v":""},null,null,null,null,null,10]
[null,null,11,null,null,null,{"$f":"IF(F16=\"\",\"\",VLOOKUP(F16,残高表!$Y$5:$Z$20,2))","v":""},null,null,null,{"$f":"IF(J16=\"\",\"\",VLOOKUP(J16,残高表!$Y$5:$Z$20,2))","v":""},null,null,null,{"$f":"IF(N16=\"\",\"\",VLOOKUP(N16,残高表!$Y$5:$Z$20,2))","v":""},null,null,null,{"$f":"IF(R16=\"\",\"\",VLOOKUP(R16,残高表!$Y$5:$Z$20,2))","v":""},null,null,null,null,null,11]
[null,null,12,null,null,null,{"$f":"IF(F17=\"\",\"\",VLOOKUP(F17,残高表!$Y$5:$Z$20,2))","v":""},null,null,null,{"$f":"IF(J17=\"\",\"\",VLOOKUP(J17,残高表!$Y$5:$Z$20,2))","v":""},null,null,null,{"$f":"IF(N17=\"\",\"\",VLOOKUP(N17,残高表!$Y$5:$Z$20,2))","v":""},null,null,null,{"$f":"IF(R17=\"\",\"\",VLOOKUP(R17,残高表!$Y$5:$Z$20,2))","v":""},null,null,null,null,null,12]
[null,null,13,null,null,null,{"$f":"IF(F18=\"\",\"\",VLOOKUP(F18,残高表!$Y$5:$Z$20,2))","v":""},null,null,null,{"$f":"IF(J18=\"\",\"\",VLOOKUP(J18,残高表!$Y$5:$Z$20,2))","v":""},null,null,null,{"$f":"IF(N18=\"\",\"\",VLOOKUP(N18,残高表!$Y$5:$Z$20,2))","v":""},null,null,null,{"$f":"IF(R18=\"\",\"\",VLOOKUP(R18,残高表!$Y$5:$Z$20,2))","v":""},null,null,null,null,null,13]
[null,null,14,null,null,null,{"$f":"IF(F19=\"\",\"\",VLOOKUP(F19,残高表!$Y$5:$Z$20,2))","v":""},null,null,null,{"$f":"IF(J19=\"\",\"\",VLOOKUP(J19,残高表!$Y$5:$Z$20,2))","v":""},null,null,null,{"$f":"IF(N19=\"\",\"\",VLOOKUP(N19,残高表!$Y$5:$Z$20,2))","v":""},null,null,null,{"$f":"IF(R19=\"\",\"\",VLOOKUP(R19,残高表!$Y$5:$Z$20,2))","v":""},null,null,null,null,null,14]
[null,null,15,null,null,null,{"$f":"IF(F20=\"\",\"\",VLOOKUP(F20,残高表!$Y$5:$Z$20,2))","v":""},null,null,null,{"$f":"IF(J20=\"\",\"\",VLOOKUP(J20,残高表!$Y$5:$Z$20,2))","v":""},null,null,null,{"$f":"IF(N20=\"\",\"\",VLOOKUP(N20,残高表!$Y$5:$Z$20,2))","v":""},null,null,null,{"$f":"IF(R20=\"\",\"\",VLOOKUP(R20,残高表!$Y$5:$Z$20,2))","v":""},null,null,null,null,null,15,"その他"]
{"$rows_left_out":186}
{"sheet":"選択表","index":2,"n_rows":204,"n_cols":16,"rows_kept":204,"cut":false,"hidden":false,"merged":[]}
[]
[null,"一人消去",null,{"$f":"10-COUNTBLANK(B5:B14)","v":0},null,"番号選択シート",null,null,"名簿更新",null,"※コード右クリックで入力表自動コード転記します。"]
[]
[null,"選択者",null,"表示","コード","お名前","フリガナ","コード","お名前","フリガナ","コード","お名前","フリガナ","コード","お名前","フリガナ"]
[null,{"$f":"入力表!D6","v":""},null,null,1,null,null,21,null,null,41,null,null,61]
[null,{"$f":"入力表!D7","v":""},null,null,2,null,null,22,null,null,42,null,null,62]
[null,{"$f":"入力表!D8","v":""},null,null,3,null,null,23,null,null,43,null,null,63]
[null,{"$f":"入力表!D9","v":""},null,null,4,null,null,24,null,null,44,null,null,64]
[null,{"$f":"入力表!D10","v":""},null,null,5,null,null,25,null,null,45,null,null,65]
[null,{"$f":"入力表!D11","v":""},null,null,6,null,null,26,null,null,46,null,null,66]
[null,{"$f":"入力表!D12","v":""},null,null,7,null,null,27,null,null,47,null,null,67]
[null,{"$f":"入力表!D13","v":""},null,null,8,null,null,28,null,null,48,null,null,68]
[null,{"$f":"入力表!D14","v":""},null,null,9,null,null,29,null,null,49,null,null,69]
[null,{"$f":"入力表!D15","v":""},null,null,10,null,null,30,null,null,50,null,null,70]
[null,null,null,null,11,null,null,31,null,null,51,null,null,71]
[null,null,null,null,12,null,null,32,null,null,52,null,null,72]
[null,null,null,null,13,null,null,33,null,null,53,null,null,73]
[null,null,null,null,14,null,null,34,null,null,54,null,null,74]
[null,null,null,null,15,null,null,35,null,null,55,null,null,75]
[null,null,null,null,16,null,null,36,null,null,56,null,null,76]
{"$rows_left_out":185}
{"sheet":"入力表","index":3,"n_rows":20,"n_cols":39,"rows_kept":20,"cut":false,"hidden":false,"merged":[]}
[]
[null,null,null,"転記",null,"入力シート",null,"処理\n基準日","2012-07-01",null,null,null,null,null,"明細マスタ",null,null,null,null,null,null,null,null,null,null,null,null,null,"現在日付",null,null,null,"記録数",null,"日付の入った記録","判定"]
[null,null,null,null,null,null,null,null,null,null,null,null,null,null,null,null,null,null,null,null,null,null,null,null,null,null,null,null,{"$f":"IF(I2=\"\",ROUNDDOWN(NOW(),0),I2)","v":41091},null,null,null,{"$f":"COUNTIF(AE6:AE15,\">1000\")","v":0},null,{"$f":"SUM(AM6:AM15)","v":0},{"$f":"IF(AG3=AI3,0,1)","v":0}]
[]
[null,null,"コード","お名前","フリガナ","変更","金融機関","口座番号","処理日","入金額","出金額","変更","明細",null,"コード","明細マスタ",null,null,null,null,null,null,null,null,null,null,null,null,"日付検索","名前検索","個人コード","フリガナ","金融コード","日付コード","入金額","出金額","明細",null,"判定"]
[null,null,null,{"$f":"IF(C6=\"\",\"\",VLOOKUP(C6,残高表!$C$5:$U$205,2))","v":""},{"$f":"IF(C6=\"\",\"\",VLOOKUP(C6,残高表!$C$5:$U$205,3))","v":""},null,{"$f":"IF(C6=\"\",\"\",VLOOKUP(C6,残高表!$C$5:$U$205,CHOOSE(F6+1,5,9,13,17)))","v":""},{"$f":"IF(C6=\"\",\"\",VLOOKUP(C6,残高表!$C$5:$U$205,CHOOSE(F6+1,5,9,13,17)+1))","v":""},null,null,null,null,{"$f":"IF(L6=\"\",\"\",VLOOKUP(L6,$O$5:$P$20,2))","v":""},null,1,"家族から入金",null,null,null,null,null,null,null,null,null,null,null,null,{"$f":"(AH6&AE6)*1000+(ROW()-5)","v":190001001000001},{"$f":"(AH6+AE6*100000000)*1000+ROW()-5","v":100019000100001},{"$f":"C6+1000","v":1000},{"$f":"E6","v":""},{"$f":"G6","v":""},{"$f":"YEAR(I6)*10000+MONTH(I6)*100+DAY(I6)","v":19000100},{"$f":"J6","v":0},{"$f":"K6","v":0},{"$f":"M6","v":""},null,{"$f":"IF(C6*I6>0,1,0)","v":0}]
[null,null,null,{"$f":"IF(C7=\"\",\"\",VLOOKUP(C7,残高表!$C$5:$U$205,2))","v":""},{"$f":"IF(C7=\"\",\"\",VLOOKUP(C7,残高表!$C$5:$U$205,3))","v":""},null,{"$f":"IF(C7=\"\",\"\",VLOOKUP(C7,残高表!$C$5:$U$205,CHOOSE(F7+1,5,9,13,17)))","v":""},{"$f":"IF(C7=\"\",\"\",VLOOKUP(C7,残高表!$C$5:$U$205,CHOOSE(F7+1,5,9,13,17)+1))","v":""},null,null,null,null,"",null,2,"利用料として引き落とし",null,null,null,null,null,null,null,null,null,null,null,null,190001001000002,{"$f":"(AH7+AE7*100000000)*1000+ROW()-5","v":100019000100002},1000,"",{"$f":"G7","v":""},19000100,0,0,"",null,{"$f":"IF(C7*I7>0,1,0)","v":0}]
[null,null,null,{"$f":"IF(C8=\"\",\"\",VLOOKUP(C8,残高表!$C$5:$U$205,2))","v":""},{"$f":"IF(C8=\"\",\"\",VLOOKUP(C8,残高表!$C$5:$U$205,3))","v":""},null,{"$f":"IF(C8=\"\",\"\",VLOOKUP(C8,残高表!$C$5:$U$205,CHOOSE(F8+1,5,9,13,17)))","v":""},{"$f":"IF(C8=\"\",\"\",VLOOKUP(C8,残高表!$C$5:$U$205,CHOOSE(F8+1,5,9,13,17)+1))","v":""},null,null,null,null,"",null,3,"繰越金",null,null,null,null,null,null,null,null,null,null,null,null,190001001000003,100019000100003,1000,"","",19000100,0,0,"",null,0]
[null,null,null,{"$f":"IF(C9=\"\",\"\",VLOOKUP(C9,残高表!$C$5:$U$205,2))","v":""},{"$f":"IF(C9=\"\",\"\",VLOOKUP(C9,残高表!$C$5:$U$205,3))","v":""},null,{"$f":"IF(C9=\"\",\"\",VLOOKUP(C9,残高表!$C$5:$U$205,CHOOSE(F9+1,5,9,13,17)))","v":""},{"$f":"IF(C9=\"\",\"\",VLOOKUP(C9,残高表!$C$5:$U$205,CHOOSE(F9+1,5,9,13,17)+1))","v":""},null,null,null,null,"",null,4,"口座間移動",null,null,null,null,null,null,null,null,null,null,null,null,190001001000004,100019000100004,1000,"","",19000100,0,0,"",null,0]
[null,null,null,{"$f":"IF(C10=\"\",\"\",VLOOKUP(C10,残高表!$C$5:$U$205,2))","v":""},{"$f":"IF(C10=\"\",\"\",VLOOKUP(C10,残高表!$C$5:$U$205,3))","v":""},null,{"$f":"IF(C10=\"\",\"\",VLOOKUP(C10,残高表!$C$5:$U$205,CHOOSE(F10+1,5,9,13,17)))","v":""},{"$f":"IF(C10=\"\",\"\",VLOOKUP(C10,残高表!$C$5:$U$205,CHOOSE(F10+1,5,9,13,17)+1))","v":""},null,null,null,null,"",null,5,null,null,null,null,null,null,null,null,null,null,null,null,null,190001001000005,100019000100005,1000,"","",19000100,{"$f":"J10","v":0},0,"",null,0]
[null,null,null,{"$f":"IF(C11=\"\",\"\",VLOOKUP(C11,残高表!$C$5:$U$205,2))","v":""},{"$f":"IF(C11=\"\",\"\",VLOOKUP(C11,残高表!$C$5:$U$205,3))","v":""},null,{"$f":"IF(C11=\"\",\"\",VLOOKUP(C11,残高表!$C$5:$U$205,CHOOSE(F11+1,5,9,13,17)))","v":""},{"$f":"IF(C11=\"\",\"\",VLOOKUP(C11,残高表!$C$5:$U$205,CHOOSE(F11+1,5,9,13,17)+1))","v":""},null,null,null,null,"",null,6,null,null,null,null,null,null,null,null,null,null,null,null,null,190001001000006,100019000100006,1000,"","",19000100,{"$f":"J11","v":0},0,"",null,0]
[null,null,null,{"$f":"IF(C12=\"\",\"\",VLOOKUP(C12,残高表!$C$5:$U$205,2))","v":""},{"$f":"IF(C12=\"\",\"\",VLOOKUP(C12,残高表!$C$5:$U$205,3))","v":""},null,{"$f":"IF(C12=\"\",\"\",VLOOKUP(C12,残高表!$C$5:$U$205,CHOOSE(F12+1,5,9,13,17)))","v":""},{"$f":"IF(C12=\"\",\"\",VLOOKUP(C12,残高表!$C$5:$U$205,CHOOSE(F12+1,5,9,13,17)+1))","v":""},null,null,null,null,"",null,7,null,null,null,null,null,null,null,null,null,null,null,null,null,190001001000007,100019000100007,1000,"","",19000100,0,0,"",null,0]
[null,null,null,{"$f":"IF(C13=\"\",\"\",VLOOKUP(C13,残高表!$C$5:$U$205,2))","v":""},{"$f":"IF(C13=\"\",\"\",VLOOKUP(C13,残高表!$C$5:$U$205,3))","v":""},null,{"$f":"IF(C13=\"\",\"\",VLOOKUP(C13,残高表!$C$5:$U$205,CHOOSE(F13+1,5,9,13,17)))","v":""},{"$f":"IF(C13=\"\",\"\",VLOOKUP(C13,残高表!$C$5:$U$205,CHOOSE(F13+1,5,9,13,17)+1))","v":""},null,null,null,null,"",null,8,null,null,null,null,null,null,null,null,null,null,null,null,null,190001001000008,100019000100008,1000,"","",19000100,0,0,"",null,0]
[null,null,null,{"$f":"IF(C14=\"\",\"\",VLOOKUP(C14,残高表!$C$5:$U$205,2))","v":""},{"$f":"IF(C14=\"\",\"\",VLOOKUP(C14,残高表!$C$5:$U$205,3))","v":""},null,{"$f":"IF(C14=\"\",\"\",VLOOKUP(C14,残高表!$C$5:$U$205,CHOOSE(F14+1,5,9,13,17)))","v":""},{"$f":"IF(C14=\"\",\"\",VLOOKUP(C14,残高表!$C$5:$U$205,CHOOSE(F14+1,5,9,13,17)+1))","v":""},null,null,null,null,"",null,9,null,null,null,null,null,null,null,null,null,null,null,null,null,190001001000009,100019000100009,1000,"","",19000100,0,0,"",null,0]
[null,null,null,{"$f":"IF(C15=\"\",\"\",VLOOKUP(C15,残高表!$C$5:$U$205,2))","v":""},{"$f":"IF(C15=\"\",\"\",VLOOKUP(C15,残高表!$C$5:$U$205,3))","v":""},null,{"$f":"IF(C15=\"\",\"\",VLOOKUP(C15,残高表!$C$5:$U$205,CHOOSE(F15+1,5,9,13,17)))","v":""},{"$f":"IF(C15=\"\",\"\",VLOOKUP(C15,残高表!$C$5:$U$205,CHOOSE(F15+1,5,9,13,17)+1))","v":""},null,null,null,null,"",null,10,null,null,null,null,null,null,null,null,null,null,null,null,null,190001001000010,100019000100010,1000,"","",19000100,0,0,"",null,0]
[null,null,null,null,null,null,null,null,null,null,null,null,null,null,11]
[null,null,null,null,null,null,null,null,null,null,null,null,null,null,12]
[null,null,null,null,null,null,null,null,null,null,null,null,null,null,13]
[null,null,null,null,null,null,null,null,null,null,null,null,null,null,14]
[null,null,null,null,null,null,null,null,null,null,null,null,null,null,15]
{"$rows_left_out":1}
{"sheet":"記録表","index":4,"n_rows":5,"n_cols":11,"rows_kept":5,"cut":false,"hidden":false,"merged":[]}
[]
[null,null,null,null,null,null,"記録保存シート",null,null,"保護",{"$f":"IF(J2=\"保護\",\"\",\"危険！取り扱い注意！\")","v":""}]
[null,null,null,null,"日付順","名前順",null,null,"※個人コードＷクリックで記録の１行末梢ができます。"]
[]
[null,null,"検","索","個人コード","フリガナ","金融機関","日付","入金額","出金額","明細"]

{"sheet":"条件表","index":5,"n_rows":25,"n_cols":32,"rows_kept":25,"cut":false,"hidden":false,"merged":[[6,6,6,7],[11,2,12,2],[10,1,10,2],[6,2,7,2],[6,3,7,3]]}
[]
[null,null,null,null,null,null,null,null,null,null,null,null,null,null,null,null,null,null,null,null,null,null,null,null,null,null,"月別抽出"]
[null,null,"条件選択シート",null,null,null,null,null,null,"名簿更新",null,null,null,"利用者コード選択画面",null,null,null,null,null,null,null,null,null,null,null,null,{"$f":"(B10*10000+C10*100)*10000000+1+AF4*1000","v":1002001},{"$f":"AC4-COUNTIF(記録表!$C$6:$C$65536,\">\"&AA3)+1","v":1},"レコード総数","該当記録数"]
[null,null,null,null,null,null,null,null,null,null,null,null,null,"※コード番号右クリックで転写します。",null,null,null,null,null,null,null,null,null,null,null,null,{"$f":"(B10*10000+C10*100+32)*10000000+999+AF4*1000","v":321002999},{"$f":"AC4-COUNTIF(記録表!$C$6:$C$65536,\">\"&AA4)","v":0},{"$f":"COUNT(記録表!$E$6:$E$65536)","v":0},{"$f":"AB4-AB3+1","v":0},null,{"$f":"C6+1000","v":1002}]
[null,null,"番号",null,null,null,null,null,null,null,null,null,"ｺｰﾄﾞ","お名前","ｺｰﾄﾞ","お名前","ｺｰﾄﾞ","お名前","ｺｰﾄﾞ","お名前"]
[null,null,2,"→",null,"該当する利用者個人の入出金記録を抽出します。",null,null,null,"個人記録",null,null,{"$f":"選択表!E5","v":1},{"$f":"選択表!F5","v":0},{"$f":"選択表!H5","v":21},{"$f":"選択表!I5","v":0},{"$f":"選択表!K5","v":41},{"$f":"選択表!L5","v":0},{"$f":"選択表!N5","v":61},{"$f":"選択表!O5","v":0},null,null,null,null,null,null,"個人記録数"]
[null,null,"↑","↘",null,"対象者",{"$f":"IF(C6=\"\",\"\",VLOOKUP(C6,残高表!C5:W205,2))","v":0},null,"様",null,null,null,{"$f":"選択表!E6","v":2},{"$f":"選択表!F6","v":0},{"$f":"選択表!H6","v":22},{"$f":"選択表!I6","v":0},{"$f":"選択表!K6","v":42},{"$f":"選択表!L6","v":0},{"$f":"選択表!N6","v":62},{"$f":"選択表!O6","v":0},null,null,null,null,null,null,{"$f":"AF4-1","v":1001},{"$f":"AC8-COUNTIF(記録表!$E$6:$E$65536,\">\"&AA7)+1","v":1},"レコード総数","該当記録数"]
[null,null,null,null,null,null,null,null,null,null,null,null,{"$f":"選択表!E7","v":3},{"$f":"選択表!F7","v":0},{"$f":"選択表!H7","v":23},{"$f":"選択表!I7","v":0},{"$f":"選択表!K7","v":43},{"$f":"選択表!L7","v":0},{"$f":"選択表!N7","v":63},{"$f":"選択表!O7","v":0},null,null,null,null,null,null,{"$f":"AF4","v":1002},{"$f":"AC8-COUNTIF(記録表!$E$6:$E$65536,\">\"&AA8)","v":0},{"$f":"COUNT(記録表!$E$6:$E$65536)","v":0},{"$f":"COUNTIF(記録表!E6:E65536,条件表!AF4)","v":0}]
[null,"年","月",null,null,"該当する年月の利用者個人の入出金記録を抽出します。",null,null,null,"月別個人",null,null,{"$f":"選択表!E8","v":4},{"$f":"選択表!F8","v":0},{"$f":"選択表!H8","v":24},{"$f":"選択表!I8","v":0},{"$f":"選択表!K8","v":44},{"$f":"選択表!L8","v":0},{"$f":"選択表!N8","v":64},{"$f":"選択表!O8","v":0}]
[null,null,null,null,"←","右クリックで日付入力、変更も可能です。",null,null,null,null,null,null,{"$f":"選択表!E9","v":5},{"$f":"選択表!F9","v":0},{"$f":"選択表!H9","v":25},{"$f":"選択表!I9","v":0},{"$f":"選択表!K9","v":45},{"$f":"選択表!L9","v":0},{"$f":"選択表!N9","v":65},{"$f":"選択表!O9","v":0},null,null,null,null,null,null,"個別抽出"]
[null,"↓",null,null,null,null,null,null,null,null,null,null,{"$f":"選択表!E10","v":6},{"$f":"選択表!F10","v":0},{"$f":"選択表!H10","v":26},{"$f":"選択表!I10","v":0},{"$f":"選択表!K10","v":46},{"$f":"選択表!L10","v":0},{"$f":"選択表!N10","v":66},{"$f":"選択表!O10","v":0},null,null,null,null,null,null,{"$f":"(AF4*100000000+(B10*100+C10)*100)*1000+1","v":100200000000001},{"$f":"COUNTIF(記録表!$D$6:$D$65536,\"<\"&AA11)+1","v":1},"レコード総数","該当記録数"]
[null,"はじまり","→","おわり",null,"該当する年月の全利用者の入出金記録を抽出します。",null,null,null,"全記録",null,null,{"$f":"選択表!E11","v":7},{"$f":"選択表!F11","v":0},{"$f":"選択表!H11","v":27},{"$f":"選択表!I11","v":0},{"$f":"選択表!K11","v":47},{"$f":"選択表!L11","v":0},{"$f":"選択表!N11","v":67},{"$f":"選択表!O11","v":0},null,null,null,null,null,null,{"$f":"AA11+31998","v":100200000031999},{"$f":"AC12-COUNTIF(記録表!$D$6:$D$65536,\">\"&AA12)","v":0},{"$f":"COUNT(記録表!$E$6:$E$65536)","v":0},{"$f":"AB12-AB11+1","v":0}]
[null,1,null,200,null,null,null,null,null,null,null,null,{"$f":"選択表!E12","v":8},{"$f":"選択表!F12","v":0},{"$f":"選択表!H12","v":28},{"$f":"選択表!I12","v":0},{"$f":"選択表!K12","v":48},{"$f":"選択表!L12","v":0},{"$f":"選択表!N12","v":68},{"$f":"選択表!O12","v":0}]
[null,null,null,null,null,null,null,null,null,null,null,null,{"$f":"選択表!E13","v":9},{"$f":"選択表!F13","v":0},{"$f":"選択表!H13","v":29},{"$f":"選択表!I13","v":0},{"$f":"選択表!K13","v":49},{"$f":"選択表!L13","v":0},{"$f":"選択表!N13","v":69},{"$f":"選択表!O13","v":0},null,null,null,null,null,null,"繰越抽出"]
[null,null,null,null,null,null,null,null,null,"記録抹消",null,null,{"$f":"選択表!E14","v":10},{"$f":"選択表!F14","v":0},{"$f":"選択表!H14","v":30},{"$f":"選択表!I14","v":0},{"$f":"選択表!K14","v":50},{"$f":"選択表!L14","v":0},{"$f":"選択表!N14","v":70},{"$f":"選択表!O14","v":0},null,null,null,null,null,null,{"$f":"AF4*100000000000","v":100200000000000},{"$f":"SUMIF(記録表!D6:D65536,\"<\"&AA15,記録表!I6:I65536)-SUMIF(記録表!D6:D65536,\"<\"&AA15,記録表!J6:J65536)","v":0},"結果"]
[null,null,null,null,null,null,null,null,null,null,null,null,{"$f":"選択表!E15","v":11},{"$f":"選択表!F15","v":0},{"$f":"選択表!H15","v":31},{"$f":"選択表!I15","v":0},{"$f":"選択表!K15","v":51},{"$f":"選択表!L15","v":0},{"$f":"選択表!N15","v":71},{"$f":"選択表!O15","v":0},null,null,null,null,null,null,{"$f":"AA11-2","v":100199999999999},{"$f":"SUMIF(記録表!D6:D65536,\"<\"&AA16,記録表!I6:I65536)-SUMIF(記録表!D6:D65536,\"<\"&AA16,記録表!J6:J65536)","v":0},{"$f":"AB16-AB15","v":0}]
[null,null,null,null,null,null,null,null,null,null,null,null,{"$f":"選択表!E16","v":12},{"$f":"選択表!F16","v":0},{"$f":"選択表!H16","v":32},{"$f":"選択表!I16","v":0},{"$f":"選択表!K16","v":52},{"$f":"選択表!L16","v":0},{"$f":"選択表!N16","v":72},{"$f":"選択表!O16","v":0}]
[null,null,null,null,null,null,null,null,null,null,null,null,{"$f":"選択表!E17","v":13},{"$f":"選択表!F17","v":0},{"$f":"選択表!H17","v":33},{"$f":"選択表!I17","v":0},{"$f":"選択表!K17","v":53},{"$f":"選択表!L17","v":0},{"$f":"選択表!N17","v":73},{"$f":"選択表!O17","v":0},null,null,null,null,null,null,"日付","月"]
[null,null,null,null,null,null,null,null,null,null,null,null,{"$f":"選択表!E18","v":14},{"$f":"選択表!F18","v":0},{"$f":"選択表!H18","v":34},{"$f":"選択表!I18","v":0},{"$f":"選択表!K18","v":54},{"$f":"選択表!L18","v":0},{"$f":"選択表!N18","v":74},{"$f":"選択表!O18","v":0},null,null,null,null,null,null,{"$f":"YEAR(NOW())","v":2012},{"$f":"MONTH(NOW())","v":6}]
[null,null,null,null,null,null,null,null,null,null,null,null,{"$f":"選択表!E19","v":15},{"$f":"選択表!F19","v":0},{"$f":"選択表!H19","v":35},{"$f":"選択表!I19","v":0},{"$f":"選択表!K19","v":55},{"$f":"選択表!L19","v":0},{"$f":"選択表!N19","v":75},{"$f":"選択表!O19","v":0}]
{"$rows_left_out":6}
{"sheet":"抽出表","index":6,"n_rows":5,"n_cols":35,"rows_kept":5,"cut":false,"hidden":false,"merged":[]}
[]
[null,null,null,null,null,null,"記録抽出シート",null,null,null,null,null,null,null,null,null,null,null,null,null,null,null,null,null,null,null,{"$f":"MAX($AA$6:$AA$2006)+1","v":1},{"$f":"MAX($AB$6:$AB$2006)+1","v":1},"－","前月繰越残高",{"$f":"条件表!$AC$16","v":0},{"$f":"IF(条件表!B10=\"\",MAX(AF6:AF2000),条件表!$B$10&条件表!$B$9&条件表!$C$10&条件表!$C$9)","v":0},{"$f":"SUM($AG$6:$AG$2006)","v":0},{"$f":"SUM($AH$6:$AH$2006)","v":0},{"$f":"$AG$2-$AH$2","v":0}]
[null,null,null,null,"消去",null,null,null,null,null,null,null,null,null,null,null,null,null,null,null,null,null,null,null,null,null,{"$f":"$AA$2+1","v":2},{"$f":"$AB$2+1","v":2},"－","月末繰越残高",{"$f":"AE2+AI2","v":0},"残高",{"$f":"SUMIF(記録表!$E$6:$E$65536,$AC$6,記録表!$I$6:$I$65536)-SUMIF(記録表!$E$6:$E$65536,$AC$6,記録表!$J$6:$J$65536)","v":0},"現在差額",{"$f":"-(AE3-AG3)","v":0}]
[]
[null,null,"日付検索","フリガナ検索","個人コード","フリガナ","金融機関","日付","入金額","出金額","明細／月間小計",null,null,null,null,null,null,null,null,null,null,null,null,null,null,null,"日付検索","フリガナ検索","個人コード","フリガナ","金融機関","日付","入金額","出金額","明細"]