{"text_format":"1","workbook":"xlsx","n_sheets":4,"sheets":["モデルシート","入力シート","記録シート１","記録シート２"],"not_rendered":{"charts":0,"images":0,"macros":1,"external_links":0,"defined_names":3,"comments":0,"pivot_tables":0},"unopened":[],"bounds":{"document_bytes":16777216,"sheet_cells":100000,"rows_first":2000,"rows_last":500,"rows_between":2000,"halvings":0,"cell_chars":16384,"cell_head_chars":4096},"cells_cut":0,"cells_raw":0,"read":"whole","date_system":"1900"}

{"sheet":"モデルシート","index":0,"n_rows":50,"n_cols":44,"rows_kept":50,"cut":false,"hidden":false,"merged":[[1,4,1,6],[2,4,2,6],[4,3,5,15],[6,15,6,16],[8,9,9,11],[8,12,9,12],[10,9,10,10],[10,11,10,12],[1,13,1,14],[1,8,2,12],[6,17,6,20],[7,3,7,4],[7,5,7,7],[33,14,34,15],[33,16,34,20],[30,14,31,15],[30,16,31,20],[17,9,17,10],[17,12,17,20],[18,12,18,20],[19,12,19,20],[14,5,14,6],[15,3,15,4],[15,5,15,7],[15,8,15,9],[15,10,15,13],[8,3,10,7],[8,8,10,8],[36,14,37,15],[36,16,37,20],[39,14,40,15],[39,16,40,20],[41,14,42,14],[41,15,42,20],[27,14,28,15],[27,16,28,20],[11,10,11,12],[12,10,14,20],[15,14,15,20],[20,12,20,20],[21,8,21,10],[21,12,21,20],[24,14,25,15],[24,16,25,20],[49,3,49,5],[42,5,42,12],[45,6,45,8],[45,9,46,20],[46,6,46,8],[47,6,47,20],[48,3,48,5],[48,6,48,20],[47,3,47,5],[44,3,44,5],[44,6,44,8],[45,3,45,5],[46,3,46,5],[7,26,7,27],[7,28,7,30],[8,26,10,30],[8,31,10,31],[8,32,9,34],[4,26,5,38],[6,38,6,39],[6,40,6,43],[3,26,3,27],[3,36,3,37],[3,39,3,40],[14,28,14,29],[15,26,15,27],[15,28,15,30],[15,31,15,32],[15,33,15,36],[8,35,9,35],[10,32,10,33],[10,34,10,35],[11,33,11,35],[12,33,14,43],[20,35,20,43],[21,31,21,33],[21,35,21,43],[24,37,25,38],[24,39,25,43],[15,37,15,43],[17,32,17,33],[17,35,17,43],[18,35,18,43],[19,35,19,43],[36,37,37,38],[36,39,37,43],[39,37,40,38],[39,39,40,43],[41,37,42,37],[41,38,42,43],[27,37,28,38],[27,39,28,43],[30,37,31,38],[30,39,31,43],[33,37,34,38],[33,39,34,43],[47,26,47,28],[47,29,47,43],[48,26,48,28],[48,29,48,43],[49,26,49,28],[42,28,42,35],[44,26,44,28],[44,29,44,31],[45,26,45,28],[45,29,45,31],[45,32,46,43],[46,26,46,28],[46,29,46,31]]}
[]
[null,null,null,null,"変更可能な部分",null,null,null,"デザイン変更はこの画面から。\nまた、デフォルト（初期設定）として入力に反映します。",null,null,null,null,"印刷"]
[null,null,null,null,"クリック変更"]
[]
[null,null,null,"特別養護老人ホーム辰巳萬緑苑・経口移行・維持計画書",null,null,null,null,null,null,null,null,null,null,null,null,null,null,null,null,null,null,null,null,null,null,{"$f":"D5","v":"特別養護老人ホーム辰巳萬緑苑・経口移行・維持計画書"},{"$f":"E5","v":0},{"$f":"F5","v":0},{"$f":"G5","v":0},{"$f":"H5","v":0},{"$f":"I5","v":0},{"$f":"J5","v":0},{"$f":"K5","v":0},{"$f":"L5","v":0},{"$f":"M5","v":0},{"$f":"N5","v":0},{"$f":"O5","v":0},{"$f":"P5","v":0}]
[null,null,null,null,null,null,null,null,null,null,null,null,null,null,null,null,null,null,null,null,null,null,null,null,null,null,0,0,0,0,0,0,0,0,0,0,0,0,0]
[null,null,null,"１．基本情報",null,null,null,null,null,null,null,null,null,null,null,"記録日",null,null,null,null,null,null,null,null,null,null,"１．基本情報",null,null,null,null,null,null,null,null,null,null,null,"記録日"]
[null,null,null,"フリガナ\nお名前",null,null,null,null,"性別","生年月日",null,null,"年齢","経口摂取の状態",null,null,null,"■","初回","□","継続",null,null,null,null,null,"フリガナ\nお名前",null,null,null,null,"性別","生年月日",null,null,"年齢","経口摂取の状態",null,null,null,{"$f":"R8","v":"■"},"初回",{"$f":"T8","v":"□"},"継続"]
[null,null,null,null,null,null,null,null,null,{"$f":"IF($D$4=\"\",\"\",VLOOKUP($D$4,記録シート１!$D$6:$CG$2007,AJ57))","v":""},{"$f":"IF($D$4=\"\",\"\",VLOOKUP($D$4,記録シート１!$D$6:$CG$2007,AK57))","v":""},{"$f":"IF($D$4=\"\",\"\",VLOOKUP($D$4,記録シート１!$D$6:$CG$2007,AL57))","v":""},{"$f":"IF(OR(J9=\"\",J9=0),\"\",DATEDIF(J9,TODAY(),\"y\"))","v":""},"□","自歯の使用あり",null,null,"算定加算",null,null,null,null,null,null,null,null,null,null,null,null,null,null,{"$f":"IF($D$4=\"\",\"\",VLOOKUP($D$4,記録シート１!$D$6:$CG$2007,BG57))","v":""},{"$f":"IF($D$4=\"\",\"\",VLOOKUP($D$4,記録シート１!$D$6:$CG$2007,BH57))","v":""},{"$f":"IF($D$4=\"\",\"\",VLOOKUP($D$4,記録シート１!$D$6:$CG$2007,BI57))","v":""},{"$f":"IF(OR(AG9=\"\",AG9=0),\"\",DATEDIF(AG9,TODAY(),\"y\"))","v":""},"□","自歯の使用あり",null,null,"算定加算"]
[null,null,null,null,null,null,null,null,null,{"$f":"IF($D$4=\"\",\"\",VLOOKUP($D$4,記録シート１!$D$6:$CG$2007,AJ58))","v":""},{"$f":"IF($D$4=\"\",\"\",VLOOKUP($D$4,記録シート１!$D$6:$CG$2007,AK58))","v":""},{"$f":"IF($D$4=\"\",\"\",VLOOKUP($D$4,記録シート１!$D$6:$CG$2007,AL58))","v":""},null,"□","義歯の使用あり",null,null,"□","経口移行加算",null,null,null,null,null,null,null,null,null,null,null,null,null,{"$f":"IF($D$4=\"\",\"\",VLOOKUP($D$4,記録シート１!$D$6:$CG$2007,BG58))","v":""},{"$f":"IF($D$4=\"\",\"\",VLOOKUP($D$4,記録シート１!$D$6:$CG$2007,BH58))","v":""},{"$f":"IF($D$4=\"\",\"\",VLOOKUP($D$4,記録シート１!$D$6:$CG$2007,BI58))","v":""},null,{"$f":"N10","v":"□"},"義歯の使用あり",null,null,{"$f":"R10","v":"□"},"経口移行加算"]
{"$rows_left_out":41}
{"sheet":"入力シート","index":1,"n_rows":147,"n_cols":162,"rows_kept":147,"cut":false,"hidden":false,"merged":[[94,6,94,8],[95,9,96,20],[97,6,97,20],[54,3,55,15],[56,15,56,16],[56,17,56,20],[57,3,57,4],[57,5,57,7],[58,3,60,7],[58,8,60,8],[58,9,59,11],[58,12,59,12],[60,9,60,10],[60,11,60,12],[95,3,95,5],[95,6,95,8],[96,3,96,5],[96,6,96,8],[97,3,97,5],[67,9,67,10],[67,12,67,20],[61,10,61,12],[62,10,64,20],[64,5,64,6],[98,3,98,5],[98,6,98,20],[68,12,68,20],[99,3,99,5],[86,14,87,15],[86,16,87,20],[89,14,90,15],[89,16,90,20],[91,14,92,14],[91,15,92,20],[80,14,81,15],[80,16,81,20],[83,14,84,15],[83,16,84,20],[74,14,75,15],[74,16,75,20],[77,14,78,15],[77,16,78,20],[69,12,69,20],[70,12,70,20],[71,12,71,20],[71,8,71,10],[92,5,92,12],[94,3,94,5],[65,3,65,4],[65,5,65,7],[65,8,65,9],[65,10,65,13],[65,14,65,20],[145,29,145,31],[145,32,145,46],[136,42,137,46],[138,40,139,40],[138,41,139,46],[115,38,115,46],[116,38,116,46],[117,38,117,46],[118,34,118,36],[118,38,118,46],[121,40,122,41],[121,42,122,46],[124,40,125,41],[124,42,125,46],[108,36,108,38],[109,36,111,46],[111,31,111,32],[112,29,112,30],[112,31,112,33],[146,29,146,31],[1,55,1,56],[1,58,1,59],[1,6,1,7],[0,58,0,59],[1,13,1,14],[1,16,1,17],[139,31,139,38],[141,29,141,31],[141,32,141,34],[142,29,142,31],[142,32,142,34],[142,35,143,46],[143,29,143,31],[143,32,143,34],[144,29,144,31],[144,32,144,46],[127,40,128,41],[127,42,128,46],[130,40,131,41],[130,42,131,46],[133,40,134,41],[133,42,134,46],[136,40,137,41],[112,34,112,35],[112,36,112,39],[112,40,112,46],[114,35,114,36],[114,38,114,46],[1,3,1,4],[101,29,102,41],[103,41,103,42],[103,43,103,46],[104,29,104,30],[104,31,104,33],[105,29,107,33],[105,34,107,34],[105,35,106,37],[105,38,106,38],[107,35,107,36],[107,37,107,38],[33,16,34,20],[36,14,37,15],[36,16,37,20],[39,14,40,15],[39,16,40,20],[47,3,47,5],[46,6,46,8],[11,36,11,38],[4,29,5,41],[6,41,6,42],[4,3,5,15],[20,38,20,46],[6,43,6,46],[7,29,7,30],[7,31,7,33],[19,38,19,46],[8,3,10,7],[8,8,10,8],[15,3,15,4],[15,5,15,7],[15,8,15,9],[11,10,11,12],[12,36,14,46],[14,31,14,32],[15,29,15,30],[15,31,15,33],[15,36,15,39],[15,40,15,46],[15,14,15,20],[12,10,14,20],[18,12,18,20],[49,3,49,5],[7,3,7,4],[24,14,25,15],[24,16,25,20],[27,14,28,15],[27,16,28,20],[44,3,44,5],[45,3,45,5],[46,3,46,5],[41,15,42,20],[41,14,42,14],[44,6,44,8],[45,6,45,8],[45,9,46,20],[30,14,31,15],[30,16,31,20],[14,5,14,6],[19,12,19,20],[47,6,47,20],[20,12,20,20],[21,12,21,20],[15,10,15,13],[48,3,48,5],[48,6,48,20],[33,14,34,15],[49,29,49,31],[44,29,44,31],[44,32,44,34],[45,29,45,31],[45,32,45,34],[15,34,15,35],[17,9,17,10],[21,8,21,10],[42,5,42,12],[17,12,17,20],[45,35,46,46],[46,29,46,31],[46,32,46,34],[39,40,40,41],[39,42,40,46],[41,40,42,40],[41,41,42,46],[42,31,42,38],[4,55,5,67],[6,67,6,68],[15,55,15,56],[15,57,15,59],[15,60,15,61],[15,62,15,65],[15,66,15,72],[8,55,10,59],[8,60,10,60],[11,62,11,64],[8,61,9,63],[8,64,9,64],[10,61,10,62],[10,63,10,64],[21,60,21,62],[21,64,21,72],[6,69,6,72],[7,55,7,56],[7,57,7,59],[47,29,47,31],[47,32,47,46],[48,29,48,31],[48,32,48,46],[30,40,31,41],[30,42,31,46],[33,40,34,41],[33,42,34,46],[36,40,37,41],[36,42,37,46],[21,34,21,36],[21,38,21,46],[24,40,25,41],[24,42,25,46],[27,40,28,41],[27,42,28,46],[17,35,17,36],[17,38,17,46],[18,38,18,46],[12,62,14,72],[14,57,14,58],[24,66,25,67],[24,68,25,72],[27,66,28,67],[27,68,28,72],[17,61,17,62],[17,64,17,72],[18,64,18,72],[19,64,19,72],[20,64,20,72],[39,66,40,67],[39,68,40,72],[41,66,42,66],[41,67,42,72],[42,57,42,64],[30,66,31,67],[30,68,31,72],[33,66,34,67],[33,68,34,72],[36,66,37,67],[36,68,37,72],[47,55,47,57],[47,58,47,72],[48,55,48,57],[48,58,48,72],[49,55,49,57],[44,55,44,57],[44,58,44,60],[45,55,45,57],[45,58,45,60],[45,61,46,72],[46,55,46,57],[46,58,46,60],[3,3,3,4],[3,13,3,14],[3,16,3,17],[8,9,9,11],[8,12,9,12],[10,9,10,10],[10,11,10,12],[8,35,9,37],[8,38,9,38],[10,35,10,36],[10,37,10,38],[8,29,10,33],[8,34,10,34],[7,5,7,7],[6,15,6,16],[6,17,6,20],[52,29,53,41],[54,41,54,42],[54,43,54,46],[55,29,55,30],[55,31,55,33],[56,29,58,33],[56,34,58,34],[56,35,57,37],[56,38,57,38],[58,35,58,36],[58,37,58,38],[59,36,59,38],[60,36,62,46],[62,31,62,32],[63,29,63,30],[63,31,63,33],[63,34,63,35],[63,36,63,39],[63,40,63,46],[65,35,65,36],[65,38,65,46],[66,38,66,46],[67,38,67,46],[68,38,68,46],[69,34,69,36],[69,38,69,46],[72,40,73,41],[72,42,73,46],[75,40,76,41],[75,42,76,46],[78,40,79,41],[78,42,79,46],[81,40,82,41],[81,42,82,46],[84,40,85,41],[84,42,85,46],[87,40,88,41],[87,42,88,46],[89,40,90,40],[89,41,90,46],[96,29,96,31],[96,32,96,46],[97,29,97,31],[90,31,90,38],[92,29,92,31],[92,32,92,34],[93,29,93,31],[93,32,93,34],[93,35,94,46],[94,29,94,31],[94,32,94,34],[95,29,95,31],[95,32,95,46]]}
[null,null,null,null,null,null,null,null,null,null,null,null,null,null,null,null,null,null,null,null,null,null,null,null,null,null,null,null,null,null,null,null,null,null,null,null,null,null,null,null,null,null,null,null,null,null,null,null,null,"名前の入力",null,null,null,null,null,null,null,"初めての記録\n大きな変化\n確実に残す","微修正\n記事訂正",null,null,null,null,null,null,null,null,null,null,null,null,null,null,null,null,null,null,null,null,null,{"$f":"YEAR(CF1)*10000","v":20150000},{"$f":"MONTH(CF1)*100","v":400},{"$f":"DAY(CF1)","v":11},{"$f":"$BR$7","v":"2015-04-11"}]
[null,null,null,"新規",null,"呼出","参照入力",null,null,null,null,null,null,"単票印刷",null,null,"連続印刷",null,null,null,null,null,null,null,null,null,null,null,null,null,null,null,null,null,null,null,null,null,null,null,null,null,null,null,null,null,null,null,null,{"$f":"IF(OR(BF8=0,BF8=\"\"),0,1)*IF(OR(BD9=0,BD9=\"\"),0,1)","v":0},null,null,null,null,null,"戻る",null,"保存転写","上書転写",null,null,null,null,null,null,null,null,null,null,null,null,null,null,null,null,null,null,null,null,null,0,1,2,3,4,5,6,6,7,8,9,10,11,12,13,14,15,16,17,18,19,20,21,22,23,24,25,26,27,28,29,30,31,32,33,34,35,36,37,38,39,40,41,42,43,44,45,46,47,48,49,50,51,52,53,54,55,56,57,58,59,60,61,62,63,64,65,66,67,68,69,70,71,72,73,74,75,76,77,78,79,80]
[null,null,null,null,null,null,null,null,null,null,null,null,null,null,null,null,null,null,null,null,null,null,null,null,null,null,null,null,null,null,null,null,null,null,null,null,null,null,null,null,null,null,null,null,null,null,null,null,null,null,null,null,null,null,null,null,null,null,null,null,null,null,null,null,null,null,null,null,null,null,null,null,null,null,null,null,null,null,null,null,"番号","記録日","お名前","フリガナ","性別","生年月日","要介護度","初回","継続","自歯の使用あり","義歯の使用あり","食事介助の必要あり","その他（以下に記述）","経口移行加算","経口維持加算Ⅰ","経口維持加算Ⅱ","水飲みテスト","食事観察による確認","その他","理由","認知機能","咀嚼・口腔機能","嚥下機能","理由","確認日","協力医療機関","協力医療機関","観察・検討した日","医師・歯科医師","介護支援専門員","看護職員","施設長","管理栄養士","担当介護職員","ご家族","その他","その他","食事の環境","食事の形態","摂取の方法","療養食など","持病・治療","チェック41","チェック42","チェック43","チェック44","チェック45","チェック46","チェック47","チェック48","チェック49","チェック50","チェック51","チェック52","チェック53","チェック54","チェック55","チェック56","チェック57","チェック58","チェック59","チェック60","チェック61","食事形態の変化の必要性","内容","補助食の必要性","内容","食事介助方法","内容","口腔ケアの方法","内容","医療または歯科受診の必要性","内容","食事環境の変更の必要性","内容","その他","初回作成日","計画変更日","計画作成者","解決すべき課題や目標","ご家族の意見など","備　　考"]
[null,null,null,null,null,null,null,null,null,null,null,null,null,1,null,"～",2,null,null,null,null,null,null,null,null,null,null,{"$f":"IF(AB7=0,\"\",DATE(AB8,AB9,AB10))","v":""},null,null,null,null,null,null,null,null,null,null,null,null,null,null,null,null,null,null,null,null,null,null,null,null,null,null,null,null,null,null,null,null,null,null,null,null,null,null,null,null,null,null,null,null,null,null,null,null,null,null,null,null,{"$f":"ROW()-6","v":-2},{"$f":"$CC$1+$CD$1+$CE$1","v":20150411},{"$f":"$BD$9","v":0},{"$f":"$BF$8","v":0},{"$f":"$BI$9","v":0},{"$f":"$BJ$9","v":"00:00:00"},{"$f":"$BL$11","v":0},{"$f":"$BR$8","v":"■"},{"$f":"$BT$8","v":"□"},{"$f":"$BN$9","v":"□"},{"$f":"$BN$10","v":"□"},{"$f":"$BN$11","v":"■"},{"$f":"$BN$12","v":"□"},{"$f":"$BR$10","v":"□"},{"$f":"$BR$11","v":"■"},{"$f":"$BR$12","v":"□"},{"$f":"$AD$13","v":"□"},{"$f":"$AD$14","v":"■"},{"$f":"$AD$15","v":"□"},{"$f":"$BF$15","v":0},{"$f":"$BH$13","v":"□"},{"$f":"$BH$14","v":"□"},{"$f":"$BH$15","v":"□"},{"$f":"$BK$13","v":0},{"$f":"$BF$16","v":"00:00:00"},{"$f":"$BK$16","v":"医療法人社団琢心会　辰巳病院"},{"$f":"$BO$16","v":"ここのえ歯科医院"},{"$f":"$BJ$18","v":"00:00:00"},{"$f":"$BD$19","v":"□"},{"$f":"$BD$20","v":"■"},{"$f":"$BD$21","v":"■"},{"$f":"$BD$22","v":"■"},{"$f":"$BH$19","v":"■"},{"$f":"$BH$20","v":"■"},{"$f":"$BH$21","v":"□"},{"$f":"$BH$22","v":"□"},{"$f":"$BI$22","v":0},{"$f":"$BM$18","v":0},{"$f":"$BM$19","v":0},{"$f":"$BM$20","v":0},{"$f":"$BM$21","v":0},{"$f":"$BM$22","v":0},{"$f":"$BD$24","v":0},{"$f":"$BD$25","v":0},{"$f":"$BD$26","v":0},{"$f":"$BD$27","v":0},{"$f":"$BD$28","v":0},{"$f":"$BD$29","v":0},{"$f":"$BD$30","v":0},{"$f":"$BD$31","v":0},{"$f":"$BD$32","v":0},{"$f":"$BD$33","v":0},{"$f":"$BD$34","v":0},{"$f":"$BD$35","v":0},{"$f":"$BD$36","v":0},{"$f":"$BD$37","v":0},{"$f":"$BD$38","v":0},{"$f":"$BD$39","v":0},{"$f":"$BD$40","v":0},{"$f":"$BD$41","v":0},{"$f":"$BD$42","v":0},{"$f":"$BD$43","v":0},{"$f":"$BF$43","v":0},{"$f":"$BO$25","v":"現状継続"},{"$f":"$BQ$25","v":0},{"$f":"$BO$28","v":"現状継続"},{"$f":"$BQ$28","v":0},{"$f":"$BO$31","v":"現状継続"},{"$f":"$BQ$31","v":0},{"$f":"$BO$34","v":"現状継続"},{"$f":"$BQ$34","v":0},{"$f":"$BO$37","v":"現状継続"},{"$f":"$BQ$37","v":0},{"$f":"$BO$40","v":"現状継続"},{"$f":"$BQ$40","v":0},{"$f":"$BP$42","v":0},{"$f":"$BG$45","v":"00:00:00"},{"$f":"$BG$46","v":"00:00:00"},{"$f":"$BG$47","v":"星野徳明（介護支援専門員）"},{"$f":"$BJ$46","v":0},{"$f":"$BG$48","v":0},{"$f":"$BG$49","v":0}]
[null,null,null,{"$f":"モデルシート!$D$5","v":"特別養護老人ホーム辰巳萬緑苑・経口移行・維持計画書"},null,null,null,null,null,null,null,null,null,null,null,null,null,null,null,null,null,null,null,null,null,null,null,null,null,"特別養護老人ホーム辰巳萬緑苑・経口移行・維持計画書",null,null,null,null,null,null,null,null,null,null,null,null,null,null,null,null,null,null,null,null,null,null,null,null,null,"特別養護老人ホーム辰巳萬緑苑・経口移行・維持計画書"]
[]
[null,null,null,"１．基本情報",null,null,null,null,null,null,null,null,null,null,null,"記録日",null,{"$f":"$AB$4","v":""},null,null,null,null,null,null,null,null,null,{"$f":"IF($D$4=\"\",0,VLOOKUP($D$4,記録シート１!$D$6:$CG$2007,AR55))","v":0},null,"１．基本情報",null,null,null,null,null,null,null,null,null,null,null,"記録日",null,{"$f":"NOW()","v":"2015-04-11T21:19:41.230"},null,null,null,null,null,null,null,null,null,null,null,"１．基本情報",null,null,null,null,null,null,null,null,null,null,null,"記録日",null,"2015-04-11"]
[null,null,null,"フリガナ\nお名前",null,{"$f":"IF($D$4=\"\",\"\",VLOOKUP($D$4,記録シート１!$D$6:$CG$2007,AF56))","v":""},{"$f":"IF($D$4=\"\",\"\",VLOOKUP($D$4,記録シート１!$D$6:$CG$2007,AG56))","v":""},{"$f":"IF($D$4=\"\",\"\",VLOOKUP($D$4,記録シート１!$D$6:$CG$2007,AH56))","v":""},"性別","生年月日",null,null,"年齢","経口摂取の状態",null,null,null,{"$f":"IF($D$4=\"\",\"\",VLOOKUP($D$4,記録シート１!$D$6:$CG$2007,AR56))","v":""},"初回",{"$f":"IF($D$4=\"\",\"\",VLOOKUP($D$4,記録シート１!$D$6:$CG$2007,AT56))","v":""},"継続",null,null,null,null,null,null,{"$f":"ROUND(AB7,-4)/10000","v":0},null,"フリガナ\nお名前",null,null,null,null,"性別","生年月日",null,null,"年齢","経口摂取の状態",null,null,null,{"$f":"モデルシート!$R$8","v":"■"},"初回",{"$f":"モデルシート!$T$8","v":"□"},"継続",null,null,null,null,null,null,null,null,"フリガナ\nお名前",null,null,null,null,"性別","生年月日",null,null,"年齢","経口摂取の状態",null,null,null,"■","初回","□","継続"]
[null,null,null,{"$f":"IF($D$4=\"\",\"\",VLOOKUP($D$4,記録シート１!$D$6:$CG$2007,AD57))","v":""},{"$f":"IF($D$4=\"\",\"\",VLOOKUP($D$4,記録シート１!$D$6:$CG$2007,AE57))","v":""},{"$f":"IF($D$4=\"\",\"\",VLOOKUP($D$4,記録シート１!$D$6:$CG$2007,AF57))","v":""},{"$f":"IF($D$4=\"\",\"\",VLOOKUP($D$4,記録シート１!$D$6:$CG$2007,AG57))","v":""},{"$f":"IF($D$4=\"\",\"\",VLOOKUP($D$4,記録シート１!$D$6:$CG$2007,AH57))","v":""},{"$f":"IF($D$4=\"\",\"\",VLOOKUP($D$4,記録シート１!$D$6:$CG$2007,AI57))","v":""},{"$f":"IF($D$4=\"\",\"\",VLOOKUP($D$4,記録シート１!$D$6:$CG$2007,AJ57))","v":""},{"$f":"IF($D$4=\"\",\"\",VLOOKUP($D$4,記録シート１!$D$6:$CG$2007,AK57))","v":""},{"$f":"IF($D$4=\"\",\"\",VLOOKUP($D$4,記録シート１!$D$6:$CG$2007,AL57))","v":""},{"$f":"IF(OR(J9=\"\",J9=0),\"\",DATEDIF(J9,TODAY(),\"y\"))","v":""},{"$f":"IF($D$4=\"\",\"\",VLOOKUP($D$4,記録シート１!$D$6:$CG$2007,AN57))","v":""},{"$f":"モデルシート!$O$9","v":"自歯の使用あり"},null,null,"算定加算",null,null,null,null,null,null,null,null,null,{"$f":"ROUND(AB7-AB8*10000,-2)/100","v":0},null,null,null,null,null,null,null,null,null,null,{"$f":"IF($BJ$9=\"\",\"\",DATEDIF($BJ$9,TODAY(),\"y\"))","v":""},{"$f":"モデルシート!$N$9","v":"□"},{"$f":"モデルシート!$O$9","v":"自歯の使用あり"},null,null,"算定加算",null,null,null,null,null,null,null,null,null,null,null,null,null,null,null,null,null,null,null,null,{"$f":"IF($BJ$9=\"\",\"\",DATEDIF($BJ$9,TODAY(),\"y\"))","v":""},"□","自歯の使用あり",null,null,"算定加算"]
[null,null,null,{"$f":"IF($D$4=\"\",\"\",VLOOKUP($D$4,記録シート１!$D$6:$CG$2007,AD58))","v":""},{"$f":"IF($D$4=\"\",\"\",VLOOKUP($D$4,記録シート１!$D$6:$CG$2007,AE58))","v":""},{"$f":"IF($D$4=\"\",\"\",VLOOKUP($D$4,記録シート１!$D$6:$CG$2007,AF58))","v":""},{"$f":"IF($D$4=\"\",\"\",VLOOKUP($D$4,記録シート１!$D$6:$CG$2007,AG58))","v":""},{"$f":"IF($D$4=\"\",\"\",VLOOKUP($D$4,記録シート１!$D$6:$CG$2007,AH58))","v":""},{"$f":"IF($D$4=\"\",\"\",VLOOKUP($D$4,記録シート１!$D$6:$CG$2007,AI58))","v":""},{"$f":"IF($D$4=\"\",\"\",VLOOKUP($D$4,記録シート１!$D$6:$CG$2007,AJ58))","v":""},{"$f":"IF($D$4=\"\",\"\",VLOOKUP($D$4,記録シート１!$D$6:$CG$2007,AK58))","v":""},{"$f":"IF($D$4=\"\",\"\",VLOOKUP($D$4,記録シート１!$D$6:$CG$2007,AL58))","v":""},null,{"$f":"IF($D$4=\"\",\"\",VLOOKUP($D$4,記録シート１!$D$6:$CG$2007,AN58))","v":""},{"$f":"モデルシート!$O$10","v":"義歯の使用あり"},null,null,{"$f":"IF($D$4=\"\",\"\",VLOOKUP($D$4,記録シート１!$D$6:$CG$2007,AR58))","v":""},{"$f":"モデルシート!$S$10","v":"経口移行加算"},null,null,null,null,null,null,null,null,{"$f":"AB7-AB8*10000-AB9*100","v":0},null,null,null,null,null,null,null,null,null,null,null,{"$f":"モデルシート!$N$10","v":"□"},{"$f":"モデルシート!$O$10","v":"義歯の使用あり"},null,null,{"$f":"モデルシート!$R$10","v":"□"},{"$f":"モデルシート!$S$10","v":"経口移行加算"},null,null,null,null,null,null,null,null,null,null,null,null,null,null,null,null,null,null,null,null,"□","義歯の使用あり",null,null,"□","経口移行加算"]
{"$rows_left_out":138}
{"sheet":"記録シート１","index":2,"n_rows":106,"n_cols":85,"rows_kept":106,"cut":false,"hidden":false,"merged":[[1,7,1,12]]}
[]
[null,null,null,null,"個人別記録シート",null,null,"個人の記録として、最新のものがここに記録されます。不要な記録は番号を右クリックすることで消去できます。"]
[]
[null,null,null,null,null,"名前順"]
[]
[null,null,null,"番号","記録日","お名前","フリガナ","性別","生年月日","要介護度","初回","継続","自歯の使用あり","義歯の使用あり","食事介助の必要あり","その他（以下に記述）","経口移行加算","経口維持加算Ⅰ","経口維持加算Ⅱ","水飲みテスト","食事観察による確認","その他",18,"認知機能","咀嚼・口腔機能","嚥下機能",22,"確認日","協力医療機関","協力医療機関","観察・検討した日","医師・歯科医師","介護支援専門員","看護職員","施設長","管理栄養士","担当介護職員","ご家族","その他","その他","食事の環境","食事の形態","摂取の方法","療養食など","持病・治療","チェック41","チェック42","チェック43","チェック44","チェック45","チェック46","チェック47","チェック48","チェック49","チェック50","チェック51","チェック52","チェック53","チェック54","チェック55","チェック56","チェック57","チェック58","チェック59","チェック60","チェック61","食事形態の変化の必要性","データ","補助食の必要性","データ","食事介助方法","データ","口腔ケアの方法","データ","医療または歯科受診の必要性","データ","食事環境の変更の必要性","データ","その他","初回作成日","計画変更日","計画作成者","解決すべき課題や目標","ご家族の意見など","備　　考"]
[null,null,null,{"$f":"ROW()-6","v":1}]
[null,null,null,{"$f":"ROW()-6","v":2}]
[null,null,null,{"$f":"ROW()-6","v":3}]
[null,null,null,{"$f":"ROW()-6","v":4}]
{"$rows_left_out":97}
{"sheet":"記録シート２","index":3,"n_rows":6,"n_cols":85,"rows_kept":6,"cut":false,"hidden":false,"merged":[[1,8,1,17],[3,3,3,5]]}
[]
[null,null,null,null,"保存記録シート",null,null,null,"保存転写されたものがすべてここに記録（格納）されます。不要な記録は番号を右クリックすることで消去できます。名前順、記録日付順でも検索できます。"]
[]
[null,null,"再現\nマクロ","灰色列部分を右クリックすると記録を再現します。",null,null,"名前順",null,"記録順"]
[null,null,"↓"]
[null,null,null,"番号","記録日","お名前","フリガナ","性別","生年月日","要介護度","初回","継続","自歯の使用あり","義歯の使用あり","食事介助の必要あり","その他（以下に記述）","経口移行加算","経口維持加算Ⅰ","経口維持加算Ⅱ","水飲みテスト","食事観察による確認","その他",18,"認知機能","咀嚼・口腔機能","嚥下機能",22,"確認日","協力医療機関","協力医療機関","観察・検討した日","医師・歯科医師","介護支援専門員","看護職員","施設長","管理栄養士","担当介護職員","ご家族","その他","その他","食事の環境","食事の形態","摂取の方法","療養食など","持病・治療","チェック41","チェック42","チェック43","チェック44","チェック45","チェック46","チェック47","チェック48","チェック49","チェック50","チェック51","チェック52","チェック53","チェック54","チェック55","チェック56","チェック57","チェック58","チェック59","チェック60","チェック61","食事形態の変化の必要性","データ","補助食の必要性","データ","食事介助方法","データ","口腔ケアの方法","データ","医療または歯科受診の必要性","データ","食事環境の変更の必要性","データ","その他","初回作成日","計画変更日","計画作成者","解決すべき課題や目標","ご家族の意見など","備　　考"]