{"text_format":"1","workbook":"xlsx","n_sheets":4,"sheets":["保存情報","バーセルインデックス","体力測定","BI利得"],"not_rendered":{"charts":0,"images":0,"macros":1,"external_links":0,"defined_names":2,"comments":0,"pivot_tables":0},"unopened":[],"bounds":{"document_bytes":16777216,"sheet_cells":100000,"rows_first":2000,"rows_last":500,"rows_between":2000,"halvings":0,"cell_chars":16384,"cell_head_chars":4096},"cells_cut":0,"cells_raw":0,"read":"whole","date_system":"1900"}

{"sheet":"保存情報","index":0,"n_rows":156,"n_cols":77,"rows_kept":156,"cut":false,"hidden":false,"merged":[[2,3,2,4],[3,49,3,55],[3,56,3,62],[3,63,3,69],[3,70,3,76],[2,12,2,16]]}
[]
[null,null,null,null,null,null,null,null,null,null,null,"削除番号"]
[null,null,null,"整列",null,null,null,null,null,null,null,null,{"$f":"IF(L3=\"\",\"\",VLOOKUP(L3,E7:F156,2)&\"様　を削除します。\")","v":""},null,null,null,null,{"$f":"IF(L3=\"\",\"\",\"削除\")","v":""}]
[null,null,null,null,null,null,"基本情報保存画面",null,null,null,null,null,null,null,null,null,null,null,null,null,null,null,null,null,null,null,null,null,null,null,null,null,null,null,null,null,null,null,null,null,null,null,null,null,null,null,null,null,null,"第1回",null,null,null,null,null,null,"第2回",null,null,null,null,null,null,"第３回",null,null,null,null,null,null,"第4回"]
[]
[null,null,null,null,"番号","お名前","フリガナ","性別","生年月日","介護度","測定年月日","食事","車椅子からベッドへの移動","整容","トイレ移動","入浴","歩行","階段昇降","着替え","排便コントロール","排尿コントロール","合計得点","担当者","前回測定日","食事","車椅子からベッドへの移動","整容","トイレ移動","入浴","歩行","階段昇降","着替え","排便コントロール","排尿コントロール","合計得点","前々回測定日","食事","車椅子からベッドへの移動","整容","トイレ移動","入浴","歩行","階段昇降","着替え","排便コントロール","排尿コントロール","合計得点","測定開始日","年間測定回数","握力(右)","握力(左)","通常歩行測定","立ち上がり","片足立ち","コーン廻り","評価","握力(右)","握力(左)","通常歩行測定","立ち上がり","片足立ち","コーン廻り","評価","握力(右)","握力(左)","通常歩行測定","立ち上がり","片足立ち","コーン廻り","評価","握力(右)","握力(左)","通常歩行測定","立ち上がり","片足立ち","コーン廻り","評価"]
[null,null,null,null,{"$f":"ROW()-6","v":1},"葵わかな","アオイワカナ","女","1928-03-15",1,"2018-10-03",10,2,3,4,5,6,7,8,9,10,64]
[null,null,null,null,2,"安倍晋三","アベシンゾウ","男","1941-09-21",2,"2018-07-17",10,2,3,4,5,6,7,8,9,10,64]
[null,null,null,null,3,"天地真理","アマチマリ","女","1931-01-02",1,"2018-09-18",10,2,3,4,5,6,7,8,9,10,64]
[null,null,null,null,4,"綾瀬はるか","アヤセハルカ","女","1930-03-23",2,"2018-07-31",10,2,3,4,5,6,7,8,9,10,64]
[null,null,null,null,5,"新垣結衣","アラガキユイ","女","1932-04-05",2,"2018-09-27",10,2,3,4,5,6,7,8,9,10,64]
[null,null,null,null,6,"有村架純","アリムラカスミ","女","1929-01-25",2,"2018-07-10",10,15,3,4,5,6,7,8,9,10,77]
[null,null,null,null,7,"杏","アン","女","1934-12-16",2,"2018-07-19",10,2,3,4,5,6,7,8,9,10,64]
[null,null,null,null,8,"井川遥","イガワハルカ","女","1940-09-09",3,"2018-08-27",5,2,3,4,5,6,7,8,9,10,59]
[null,null,null,null,9,"石原さとみ","イシハラサトミ","女","1930-01-14",2,"2018-07-30",10,2,3,4,5,6,7,8,9,10,64]
{"$rows_left_out":142}
{"sheet":"バーセルインデックス","index":1,"n_rows":48,"n_cols":90,"rows_kept":48,"cut":false,"hidden":false,"merged":[[47,32,49,32],[42,18,44,18],[42,19,44,19],[42,30,44,30],[42,32,44,32],[43,20,43,28],[44,20,44,28],[39,18,41,18],[39,19,41,19],[39,20,39,28],[39,30,41,30],[39,32,41,32],[40,20,40,28],[41,20,41,28],[47,30,49,30],[42,20,42,28],[36,30,38,30],[36,32,38,32],[37,20,37,28],[38,20,38,28],[33,18,35,18],[33,19,35,19],[33,20,33,28],[33,30,35,30],[33,32,35,32],[34,20,34,28],[35,20,35,28],[36,18,38,18],[36,19,38,19],[36,20,36,28],[29,18,32,18],[29,19,32,19],[29,20,29,28],[29,30,32,30],[29,32,32,32],[30,20,30,28],[31,20,31,28],[32,20,32,28],[27,18,28,18],[27,19,28,19],[27,20,27,28],[27,30,28,30],[27,32,28,32],[28,20,28,28],[24,19,26,19],[24,20,24,28],[24,30,26,30],[24,32,26,32],[25,20,25,28],[26,20,26,28],[22,18,23,18],[22,19,23,19],[22,20,22,28],[22,30,23,30],[22,32,23,32],[23,20,23,28],[24,18,26,18],[15,32,17,32],[16,20,16,28],[17,20,17,28],[14,18,14,19],[14,20,14,28],[15,18,17,18],[18,18,21,18],[18,19,21,19],[18,20,18,28],[18,30,21,30],[18,32,21,32],[19,20,19,28],[20,20,20,28],[21,20,21,28],[15,30,17,30],[9,24,9,25],[47,15,49,15],[27,13,28,13],[29,13,32,13],[23,3,23,11],[29,3,29,11],[30,3,30,11],[31,3,31,11],[32,3,32,11],[24,13,26,13],[33,3,33,11],[34,3,34,11],[39,3,39,11],[41,3,41,11],[24,3,24,11],[25,3,25,11],[26,3,26,11],[36,3,36,11],[37,3,37,11],[40,3,40,11],[35,3,35,11],[29,15,32,15],[15,19,17,19],[15,20,15,28],[9,7,9,8],[22,3,22,11],[38,3,38,11],[8,10,8,13],[8,8,8,9],[2,15,2,16],[15,1,17,1],[18,1,21,1],[27,1,28,1],[27,2,28,2],[27,3,27,11],[28,3,28,11],[24,1,26,1],[15,2,17,2],[15,13,17,13],[18,13,21,13],[22,13,23,13],[15,3,15,11],[16,3,16,11],[17,3,17,11],[14,1,14,2],[14,3,14,11],[24,2,26,2],[22,1,23,1],[22,2,23,2],[18,2,21,2],[18,3,18,11],[19,3,19,11],[20,3,20,11],[21,3,21,11],[42,1,44,1],[42,2,44,2],[43,3,43,11],[44,3,44,11],[29,1,32,1],[29,2,32,2],[33,1,35,1],[33,2,35,2],[33,13,35,13],[36,1,38,1],[36,2,38,2],[36,13,38,13],[39,1,41,1],[39,2,41,2],[39,13,41,13],[42,3,42,11],[47,13,49,13],[42,13,44,13],[47,11,49,11],[42,16,44,16],[47,16,49,16],[33,15,35,15],[36,15,38,15],[39,15,41,15],[42,15,44,15],[15,15,17,15],[18,15,21,15],[22,15,23,15],[24,15,26,15],[27,15,28,15],[15,16,17,16],[18,16,21,16],[22,16,23,16],[24,16,26,16],[27,16,28,16],[29,16,32,16],[33,16,35,16],[36,16,38,16],[39,16,41,16],[6,1,7,13],[9,11,9,13],[10,9,10,12],[11,9,11,12],[6,18,7,30],[8,25,8,26],[8,27,8,30],[9,20,9,22],[9,26,9,27],[9,28,9,30],[10,18,11,19],[10,20,11,22],[10,23,11,23],[10,24,11,25],[10,26,10,29],[11,26,11,29],[9,9,9,10],[9,1,9,2],[10,1,11,2],[10,6,11,6],[10,3,11,5],[9,3,9,5],[10,7,11,8],[9,18,9,19],[47,33,49,33],[6,35,7,47],[8,42,8,43],[8,44,8,47],[9,35,9,36],[9,37,9,39],[9,41,9,42],[9,43,9,44],[9,45,9,47],[10,35,11,36],[10,37,11,39],[10,40,11,40],[10,41,11,42],[10,43,10,46],[22,35,23,35],[22,36,23,36],[22,37,22,45],[22,47,23,47],[27,35,28,35],[27,36,28,36],[27,37,27,45],[27,47,28,47],[15,33,17,33],[18,33,21,33],[11,43,11,46],[14,35,14,36],[14,37,14,45],[15,35,17,35],[15,36,17,36],[15,37,15,45],[15,47,17,47],[15,49,17,49],[42,33,44,33],[22,33,23,33],[24,33,26,33],[27,33,28,33],[29,33,32,33],[33,33,35,33],[36,33,38,33],[39,33,41,33],[22,49,23,49],[33,35,35,35],[33,36,35,36],[33,37,33,45],[33,47,35,47],[33,49,35,49],[39,35,41,35],[39,36,41,36],[15,50,17,50],[16,37,16,45],[17,37,17,45],[18,35,21,35],[18,36,21,36],[18,37,18,45],[18,47,21,47],[18,49,21,49],[18,50,21,50],[19,37,19,45],[20,37,20,45],[21,37,21,45],[22,50,23,50],[23,37,23,45],[24,35,26,35],[24,36,26,36],[24,37,24,45],[24,47,26,47],[24,49,26,49],[24,50,26,50],[25,37,25,45],[26,37,26,45],[27,50,28,50],[28,37,28,45],[29,35,32,35],[29,36,32,36],[29,37,29,45],[29,47,32,47],[29,49,32,49],[29,50,32,50],[30,37,30,45],[31,37,31,45],[32,37,32,45],[33,50,35,50],[34,37,34,45],[35,37,35,45],[36,35,38,35],[36,36,38,36],[36,37,36,45],[36,47,38,47],[36,49,38,49],[36,50,38,50],[37,37,37,45],[38,37,38,45],[39,37,39,45],[39,47,41,47],[39,49,41,49],[39,50,41,50],[40,37,40,45],[41,37,41,45],[42,35,44,35],[42,36,44,36],[42,47,44,47],[42,49,44,49],[42,50,44,50],[43,37,43,45],[44,37,44,45],[42,37,42,45],[47,47,49,47],[47,49,49,49],[47,50,49,50],[15,54,17,54],[15,55,17,55],[18,54,21,54],[18,55,21,55],[22,54,23,54],[22,55,23,55],[24,54,26,54],[24,55,26,55],[27,54,28,54],[27,55,28,55],[29,54,32,54],[29,55,32,55],[33,54,35,54],[33,55,35,55],[36,54,38,54],[36,55,38,55],[39,54,41,54],[39,55,41,55],[42,54,44,54],[42,55,44,55],[27,49,28,49]]}
[]
[null,null,"コード"]
[null,null,1,null,"呼出",null,"印刷",null,null,null,1,"～",2,null,null,"連続印刷",null,null,null,"戻る",null,"保存",null,"更新",null,null,null,null,null,null,null,null,null,null,null,null,"戻る",null,"保存",null,"更新"]
[]
[]
[]
[null,"機能的評価：Ｂａｒｔｈｅｌ　Ｉｎｄｅｘ",null,null,null,null,null,null,null,null,null,null,null,null,null,null,null,null,"機能的評価：Ｂａｒｔｈｅｌ　Ｉｎｄｅｘ",null,null,null,null,null,null,null,null,null,null,null,null,null,null,null,null,"機能的評価：Ｂａｒｔｈｅｌ　Ｉｎｄｅｘ"]
[null,null,null,null,null,null,null,null,null,null,null,null,null,null,null,null,null,null,null,null,null,null,null,null,null,null,null,null,null,null,null,null,null,null,null,null,null,null,null,null,null,null,null,null,null,null,null,null,null,null,null,null,null,null,null,"登録者数"]
[null,null,null,null,null,null,null,null,"事業所名",null,"デイサービスたつみの森",null,null,null,null,null,null,null,null,null,null,null,null,null,null,"事業所名",null,"デイサービスたつみの森",null,null,null,null,null,null,null,null,null,null,null,null,null,null,"事業所名",null,"デイサービスたつみの森",null,null,null,null,null,null,null,null,{"$f":"NOW()","v":"2018-07-27T00:41:13.280"},null,{"$f":"COUNTA(保存情報!F7:F156)","v":86}]
[null,"フリガナ",null,{"$f":"IF($C$3=\"\",\"\",VLOOKUP($C$3,保存情報!$E$5:$BL$156,3))","v":"アオイワカナ"},null,null,"性別","介護度",null,"記録作成者",null,{"$f":"IF($C$3=\"\",\"\",VLOOKUP($C$3,保存情報!$E$5:$BL$156,19))","v":0},null,null,null,null,null,null,"フリガナ",null,"コイズミキョウコ",{"$error":"#REF!"},{"$error":"#REF!"},"性別","介護度",null,"記録作成者",null,"橋爪美幸",null,null,null,null,null,null,"フリガナ",null,{"$f":"$D$10","v":"アオイワカナ"},{"$f":"E10","v":0},0,"性別","介護度",null,"記録作成者",null,{"$f":"$L$10","v":0}]
[null,"氏名",null,{"$f":"IF($C$3=\"\",\"\",VLOOKUP($C$3,保存情報!$E$5:$BL$156,2))","v":"葵わかな"},null,null,{"$f":"IF($C$3=\"\",\"\",VLOOKUP($C$3,保存情報!$E$5:$BL$156,4))","v":"女"},{"$f":"IF($C$3=\"\",\"\",VLOOKUP($C$3,保存情報!$E$5:$BL$156,6))","v":1},null,"生年月日",null,null,null,"年齢",null,null,null,null,"氏名",null,"小泉今日子",null,null,"女",1,{"$error":"#REF!"},"生年月日",null,null,null,"年齢",null,null,null,null,"氏名",null,{"$f":"$D$11","v":"葵わかな"},null,null,{"$f":"$G$11","v":"女"},{"$f":"$H$11","v":1},{"$f":"I11","v":0},"生年月日",null,null,null,"年齢",null,null,null,null,null,"測定年月日","食事","車椅子からベッドへの移動","整容","トイレ移動","入浴","歩行","階段昇降","着替え","排便コントロール","排尿コントロール","合計得点","記録者","前回測定日","食事","車椅子からベッドへの移動","整容","トイレ移動","入浴","歩行","階段昇降","着替え","排便コントロール","排尿コントロール","合計得点","前回測定日","食事","車椅子からベッドへの移動","整容","トイレ移動","入浴","歩行","階段昇降","着替え","排便コントロール","排尿コントロール","合計得点"]
[null,null,null,null,null,null,null,null,null,{"$f":"IF($C$3=\"\",\"\",VLOOKUP($C$3,保存情報!$E$5:$BL$156,5))","v":"1928-03-15"},null,null,null,{"$f":"IF($C$3=\"\",\"\",IF($J$12=0,\"\",DATEDIF($J$12,TODAY(),\"y\")))","v":90},null,null,null,null,null,null,null,null,null,{"$error":"#REF!"},{"$error":"#REF!"},{"$error":"#REF!"},"1939-11-24",{"$error":"#REF!"},{"$error":"#REF!"},{"$error":"#REF!"},78,null,null,null,null,null,null,null,null,null,{"$f":"G12","v":0},{"$f":"H12","v":0},0,{"$f":"$J$12","v":"1928-03-15"},{"$f":"K12","v":"00:00:00"},"00:00:00","00:00:00",{"$f":"$N$12","v":90},null,null,null,null,null,{"$f":"$AE$14","v":"2018-07-05"},{"$f":"$AE$16","v":10},{"$f":"$AE$19","v":15},{"$f":"$AE$23","v":0},{"$f":"$AE$25","v":5},{"$f":"$AE$28","v":0},{"$f":"$AE$30","v":15},{"$f":"$AE$34","v":10},{"$f":"$AE$37","v":5},{"$f":"$AE$40","v":5},{"$f":"$AE$43","v":5},{"$f":"$AE$48","v":70},{"$f":"$AC$10","v":"橋爪美幸"},{"$f":"$AG$14","v":"-"},{"$f":"$AG$16","v":0},{"$f":"$AG$19","v":0},{"$f":"$AG$23","v":0},{"$f":"$AG$25","v":0},{"$f":"$AG$28","v":0},{"$f":"$AG$30","v":0},{"$f":"$AG$34","v":0},{"$f":"$AG$37","v":0},{"$f":"$AG$40","v":0},{"$f":"$AG$43","v":0},{"$f":"$AG$48","v":0},{"$f":"$AH$14","v":"-"},{"$f":"$AH$16","v":0},{"$f":"$AH$19","v":0},{"$f":"$AH$23","v":0},{"$f":"$AH$25","v":0},{"$f":"$AH$28","v":0},{"$f":"$AH$30","v":0},{"$f":"$AH$34","v":0},{"$f":"$AH$37","v":0},{"$f":"$AH$40","v":0},{"$f":"$AH$43","v":0},{"$f":"$AH$48","v":0}]
[]
[null,null,null,null,null,null,null,null,null,null,null,null,null,{"$f":"IF($C$3=\"\",\"\",VLOOKUP($C$3,保存情報!$E$5:$BL$156,7))","v":"2018-10-03"},null,{"$f":"IF($C$3=\"\",\"\",IF(VLOOKUP($C$3,保存情報!$E$5:$BL$156,20)=0,\"-\",VLOOKUP($C$3,保存情報!$E$5:$BL$156,20)))","v":"-"},{"$f":"IF($C$3=\"\",\"\",IF(VLOOKUP($C$3,保存情報!$E$5:$BL$156,20)=0,\"-\",VLOOKUP($C$3,保存情報!$E$5:$BL$156,32)))","v":"-"},null,null,null,null,null,null,null,null,null,null,null,null,null,"2018-07-05",null,"-","-",null,null,null,null,null,null,null,null,null,null,null,null,null,{"$f":"$N$14","v":"2018-10-03"},null,{"$f":"$P$14","v":"-"},{"$f":"$Q$14","v":"-"},null,null,null,"-","-"]
[null,"設問",null,"設問内容",null,null,null,null,null,null,null,null,"点数","得点",null,"前回","前々回",null,"設問",null,"設問内容",null,null,null,null,null,null,null,null,"点数","得点",null,"前回","前々回",null,"設問",null,"設問内容",null,null,null,null,null,null,null,null,"点数","得点",null,"前回","前々回",null,null,null,"前回","前々回"]
{"$rows_left_out":34}
{"sheet":"体力測定","index":2,"n_rows":23,"n_cols":88,"rows_kept":23,"cut":false,"hidden":false,"merged":[[15,85,16,86],[17,85,18,86],[19,85,20,86],[21,85,22,86],[15,87,16,88],[17,87,18,88],[19,87,20,88],[21,87,22,88],[14,85,14,88],[4,56,4,62],[4,63,4,69],[4,70,4,76],[4,77,4,83],[19,50,20,51],[21,37,22,38],[21,48,22,48],[21,49,22,49],[21,50,22,51],[15,50,16,51],[17,37,18,38],[17,48,18,48],[17,49,18,49],[17,50,18,51],[21,46,22,46],[21,47,22,47],[19,46,20,46],[19,47,20,47],[19,48,20,48],[19,49,20,49],[17,46,18,46],[17,47,18,47],[15,46,16,46],[15,47,16,47],[14,32,14,33],[15,19,16,20],[15,31,16,31],[15,32,16,33],[2,14,2,15],[4,19,5,33],[6,27,6,28],[6,29,6,33],[8,27,8,29],[8,30,8,33],[11,19,11,20],[11,21,11,22],[14,19,14,20],[14,21,14,23],[14,24,14,25],[11,23,11,25],[9,19,9,21],[9,22,9,26],[9,27,9,31],[10,19,10,21],[10,22,10,26],[10,27,10,31],[11,1,11,2],[8,12,8,15],[11,3,11,4],[11,13,11,15],[11,10,11,12],[21,44,22,44],[21,45,22,45],[21,42,22,42],[21,43,22,43],[19,44,20,44],[19,45,20,45],[19,42,20,42],[19,43,20,43],[19,37,20,38],[17,44,18,44],[17,45,18,45],[17,42,18,42],[17,43,18,43],[15,44,16,44],[15,45,16,45],[11,37,11,38],[11,39,11,40],[14,28,14,29],[14,30,14,31],[15,48,16,48],[15,49,16,49],[15,42,16,42],[15,43,16,43],[15,37,16,38],[14,42,14,43],[14,44,14,45],[14,46,14,47],[14,48,14,49],[11,41,11,43],[11,46,11,48],[11,49,11,51],[14,37,14,38],[14,39,14,41],[14,50,14,51],[10,37,10,39],[10,40,10,44],[10,45,10,49],[8,45,8,47],[8,48,8,51],[9,37,9,39],[9,40,9,44],[9,45,9,49],[4,37,5,51],[6,45,6,46],[6,47,6,51],[21,27,22,27],[21,28,22,28],[21,29,22,29],[21,30,22,30],[21,31,22,31],[21,32,22,33],[19,32,20,33],[17,27,18,27],[17,28,18,28],[17,29,18,29],[17,30,18,30],[17,31,18,31],[17,32,18,33],[11,28,11,30],[11,31,11,33],[14,26,14,27],[21,25,22,25],[21,26,22,26],[21,19,22,20],[19,27,20,27],[19,28,20,28],[19,29,20,29],[19,30,20,30],[19,31,20,31],[19,24,20,24],[19,25,20,25],[19,26,20,26],[19,19,20,20],[17,25,18,25],[17,26,18,26],[17,19,18,20],[15,27,16,27],[15,28,16,28],[15,29,16,29],[15,30,16,30],[15,24,16,24],[15,25,16,25],[15,26,16,26],[21,11,22,11],[21,12,22,12],[21,13,22,13],[19,9,20,9],[19,10,20,10],[19,11,20,11],[19,12,20,12],[19,13,20,13],[17,24,18,24],[21,24,22,24],[15,1,16,2],[17,1,18,2],[21,6,22,6],[21,7,22,7],[21,8,22,8],[21,9,22,9],[15,8,16,8],[17,9,18,9],[17,10,18,10],[21,10,22,10],[17,7,18,7],[17,8,18,8],[9,4,9,8],[10,4,10,8],[17,13,18,13],[14,3,14,5],[15,10,16,10],[15,12,16,12],[15,7,16,7],[15,9,16,9],[15,11,16,11],[15,6,16,6],[17,11,18,11],[17,12,18,12],[9,9,9,13],[10,9,10,13],[8,9,8,11],[6,9,6,10],[6,11,6,15],[4,1,5,15],[19,1,20,2],[21,1,22,2],[14,1,14,2],[9,1,9,3],[10,1,10,3],[11,5,11,7],[17,14,18,15],[19,14,20,15],[21,14,22,15],[14,6,14,7],[14,8,14,9],[14,10,14,11],[14,12,14,13],[14,14,14,15],[15,14,16,15],[19,6,20,6],[19,7,20,7],[19,8,20,8],[15,13,16,13],[17,6,18,6]]}
[]
[null,null,"コード"]
[null,null,1,null,"呼出",null,"印刷",null,null,null,1,"～",2,null,"連続印刷",null,null,null,null,null,"戻る",null,"保存",null,null,null,null,null,null,null,null,null,null,null,null,null,null,null,"戻る",null,"保存"]
[null,null,null,null,null,null,null,null,null,null,null,null,null,null,null,null,null,null,null,null,null,null,null,null,null,null,null,null,null,null,null,null,null,null,null,null,null,null,null,null,null,null,null,null,null,null,null,null,null,null,null,null,null,null,null,"データ数"]
[null,"体　力　測　定",null,null,null,null,null,null,null,null,null,null,null,null,null,null,null,null,null,"体　力　測　定",null,null,null,null,null,null,null,null,null,null,null,null,null,null,null,null,null,"体　力　測　定",null,null,null,null,null,null,null,null,null,null,null,null,null,null,null,null,null,{"$f":"COUNTA(保存情報!F7:F156)","v":86},{"$f":"$T$16","v":"H30.6"},null,null,null,null,null,null,{"$f":"$T$18","v":"H30.9"},null,null,null,null,null,null,{"$f":"$T$20","v":"H30.12"},null,null,null,null,null,null,{"$f":"$T$22","v":"H31.3"}]
[null,null,null,null,null,null,null,null,null,null,null,null,null,null,null,null,null,null,null,null,null,null,null,null,null,null,null,null,null,null,null,null,null,null,null,null,null,null,null,null,null,null,null,null,null,null,null,null,null,null,null,null,null,null,"測定開始日","年間測定回数","握力(右)","握力(左)","通常歩行測定","立ち上がり","片足立ち","コーン廻り","評価","握力(右)","握力(左)","通常歩行測定","立ち上がり","片足立ち","コーン廻り","評価","握力(右)","握力(左)","通常歩行測定","立ち上がり","片足立ち","コーン廻り","評価","握力(右)","握力(左)","通常歩行測定","立ち上がり","片足立ち","コーン廻り","評価"]
[null,null,null,null,null,null,null,null,null,"事業所名",null,"デイサービスたつみの森",null,null,null,null,null,null,null,null,null,null,null,null,null,null,null,"事業所名",null,"デイサービスたつみの森",null,null,null,null,null,null,null,null,null,null,null,null,null,null,null,"事業所名",null,"デイサービスたつみの森",null,null,null,null,null,null,{"$f":"$AF$12","v":"2017-03-01"},{"$f":"$AA$12","v":4},{"$f":"$W$16","v":20},{"$f":"$W$17","v":25},{"$f":"$Y$16","v":15},{"$f":"$AA$16","v":30},{"$f":"$AC$16","v":25},{"$f":"$AE$16","v":19},{"$f":"$AG$16","v":"やる気十分"},{"$f":"$W$18","v":21},{"$f":"$W$19","v":22},{"$f":"$Y$18","v":25},{"$f":"$AA$18","v":15},{"$f":"$AC$18","v":31},{"$f":"$AE$18","v":19},{"$f":"$AG$18","v":"退院直後なので、基礎体力の低下が見られます。"},{"$f":"$W$20","v":22},{"$f":"$W$21","v":20},{"$f":"$Y$20","v":25},{"$f":"$AA$20","v":15},{"$f":"$AC$20","v":19},{"$f":"$AE$20","v":20},{"$f":"$AG$20","v":"握力が低下しています"},{"$f":"$W$22","v":20},{"$f":"$W$23","v":20},{"$f":"$Y$22","v":20},{"$f":"$AA$22","v":25},{"$f":"$AC$22","v":19},{"$f":"$AE$22","v":18},{"$f":"$AG$22","v":"リハビリに対して熱意があります。仲間を誘っての活動にも定評があり、歩行距離は１００ｍに伸びました。"}]
[]
[null,null,null,null,null,null,null,null,null,"記録作成者",null,null,{"$f":"$AE$9","v":"橋爪美雪"},null,null,null,null,null,null,null,null,null,null,null,null,null,null,"記録作成者",null,null,"橋爪美雪",null,null,null,null,null,null,null,null,null,null,null,null,null,null,"記録作成者",null,null,"橋爪美雪"]
[null,"フリガナ",null,null,{"$f":"IF($C$3=\"\",\"\",VLOOKUP($C$3,保存情報!$E$5:$BY$156,3))","v":"アオイワカナ"},null,null,null,null,"生年月日",null,null,null,null,"年齢","性別",null,null,null,"フリガナ",null,null,"アサバヒロコ",null,null,null,null,"生年月日",null,null,null,null,"年齢","性別",null,null,null,"フリガナ",null,null,{"$f":"IF($C$3=\"\",\"\",VLOOKUP($C$3,保存情報!$E$5:$BY$156,3))","v":"アオイワカナ"},null,null,null,null,"生年月日",null,null,null,null,"年齢","性別"]
[null,"氏名",null,null,{"$f":"IF($C$3=\"\",\"\",VLOOKUP($C$3,保存情報!$E$5:$BY$156,2))","v":"葵わかな"},null,null,null,null,{"$f":"IF($C$3=\"\",\"\",VLOOKUP($C$3,保存情報!$E$5:$BY$156,5))","v":"1928-03-15"},null,null,null,null,{"$f":"IF($C$3=\"\",\"\",IF($J$11=0,\"\",DATEDIF($J$11,TODAY(),\"y\")))","v":90},{"$f":"IF($C$3=\"\",\"\",VLOOKUP($C$3,保存情報!$E$5:$BY$156,4))","v":"女"},null,null,null,"氏名",null,null,"浅場弘子",null,null,null,null,"1939-11-24",null,null,null,null,78,"女",null,null,null,"氏名",null,null,{"$f":"IF($C$3=\"\",\"\",VLOOKUP($C$3,保存情報!$E$5:$BY$156,2))","v":"葵わかな"},null,null,null,null,{"$f":"IF($C$3=\"\",\"\",VLOOKUP($C$3,保存情報!$E$5:$BY$156,5))","v":"1928-03-15"},null,null,null,null,{"$f":"IF($C$3=\"\",\"\",IF($J$11=0,\"\",DATEDIF($J$11,TODAY(),\"y\")))","v":90},{"$f":"IF($C$3=\"\",\"\",VLOOKUP($C$3,保存情報!$E$5:$BY$156,4))","v":"女"}]
[null,"介護度",null,{"$f":"IF($C$3=\"\",\"\",VLOOKUP($C$3,保存情報!$E$5:$BY$156,6))","v":1},null,"年間測定回数",null,null,{"$f":"IF($C$3=\"\",\"\",VLOOKUP($C$3,保存情報!$E$5:$BY$156,45))","v":0},"回","測定開始日",null,null,{"$f":"IF($C$3=\"\",\"\",VLOOKUP($C$3,保存情報!$E$5:$BY$156,44))","v":"00:00:00"},null,null,null,null,null,"介護度",null,1,null,"年間測定回数",null,null,4,"回","測定開始日",null,null,"2017-03-01",null,null,null,null,null,"介護度",null,{"$f":"IF($C$3=\"\",\"\",VLOOKUP($C$3,保存情報!$E$5:$BY$156,6))","v":1},null,"年間測定回数",null,null,{"$f":"IF($C$3=\"\",\"\",VLOOKUP($C$3,保存情報!$E$5:$BY$156,45))","v":0},"回","測定開始日",null,null,{"$f":"IF($C$3=\"\",\"\",VLOOKUP($C$3,保存情報!$E$5:$BY$156,44))","v":"00:00:00"}]
[]
[]
[null,"測定月",null,"握力",null,null,"通常歩行測定(5ｍ)",null,"立ち上がり\n(30秒)",null,"片足立ち",null,"コーン廻り\n(3ｍ往復)",null,"評価",null,null,null,null,"測定月",null,"握力",null,null,"通常歩行測定(5ｍ)",null,"立ち上がり\n(30秒)",null,"片足立ち",null,"コーン廻り\n(3ｍ往復)",null,"評価",null,null,null,null,"測定月",null,"握力",null,null,"通常歩行測定(5ｍ)",null,"立ち上がり\n(30秒)",null,"片足立ち",null,"コーン廻り\n(3ｍ往復)",null,"評価",null,null,null,null,null,null,null,null,null,null,null,null,null,null,null,null,null,null,null,null,null,null,null,null,null,null,null,null,null,null,null,null,null,null,"評価例定型文書（リスト）"]
{"$rows_left_out":9}
{"sheet":"BI利得","index":3,"n_rows":156,"n_cols":19,"rows_kept":156,"cut":false,"hidden":false,"merged":[[1,2,2,6]]}
[]
[null,null,"ＢＩ利得計算"]
[null,null,null,null,null,null,null,null,null,null,null,null,"要支援１","要支援２",1,2,3,4,5]
[null,null,null,null,null,null,null,null,null,null,null,null,{"$f":"COUNTIF($E$7:$E$156,M3)","v":11},{"$f":"COUNTIF($E$7:$E$156,N3)","v":5},26,23,15,3,3]
[]
[null,"番号","お名前","フリガナ","介護度","今回得点","前回得点","ＢＩ利得","予備","予備",null,"ＢＩ利得対象者",{"$f":"COUNTIF(E7:E156,\">0\")","v":70},"人","ただし、6ヶ月間の要介護者としての利用期間が必要"]
[null,{"$f":"ROW()-6","v":1},{"$f":"保存情報!F7","v":"葵わかな"},{"$f":"保存情報!G7","v":"アオイワカナ"},{"$f":"保存情報!J7","v":1},{"$f":"保存情報!V7","v":64},{"$f":"保存情報!AI7","v":0},{"$f":"IF(OR(E7=\"要支援１\",E7=\"要支援２\"),\"－\",IF(G7=0,\"－\",IF(F7>G7,1,IF(F7=G7,0,-1))))","v":"－"},null,null,null,"上記人数の85％",{"$f":"ROUNDUP(M6*0.85,0)","v":60},"人のＢＩ利得合計が０以上であること。"]
[null,2,{"$f":"保存情報!F8","v":"安倍晋三"},{"$f":"保存情報!G8","v":"アベシンゾウ"},{"$f":"保存情報!J8","v":2},{"$f":"保存情報!V8","v":64},{"$f":"保存情報!AI8","v":0},{"$f":"IF(OR(E8=\"要支援１\",E8=\"要支援２\"),\"－\",IF(G8=0,\"－\",IF(F8>G8,1,IF(F8=G8,0,-1))))","v":"－"},null,null,null,"介護度3以上の割合",{"$f":"SUM(Q4:S4)/SUM(O4:S4)","v":0.3},"基準月（前回）の要介護3以上者が15％超過。"]
[null,3,{"$f":"保存情報!F9","v":"天地真理"},{"$f":"保存情報!G9","v":"アマチマリ"},{"$f":"保存情報!J9","v":1},{"$f":"保存情報!V9","v":64},{"$f":"保存情報!AI9","v":0},"－"]
[null,4,{"$f":"保存情報!F10","v":"綾瀬はるか"},{"$f":"保存情報!G10","v":"アヤセハルカ"},{"$f":"保存情報!J10","v":2},{"$f":"保存情報!V10","v":64},{"$f":"保存情報!AI10","v":0},"－"]
[null,5,{"$f":"保存情報!F11","v":"新垣結衣"},{"$f":"保存情報!G11","v":"アラガキユイ"},{"$f":"保存情報!J11","v":2},{"$f":"保存情報!V11","v":64},{"$f":"保存情報!AI11","v":0},"－"]
[null,6,{"$f":"保存情報!F12","v":"有村架純"},{"$f":"保存情報!G12","v":"アリムラカスミ"},{"$f":"保存情報!J12","v":2},{"$f":"保存情報!V12","v":77},{"$f":"保存情報!AI12","v":0},"－"]
[null,7,{"$f":"保存情報!F13","v":"杏"},{"$f":"保存情報!G13","v":"アン"},{"$f":"保存情報!J13","v":2},{"$f":"保存情報!V13","v":64},{"$f":"保存情報!AI13","v":0},"－"]
[null,8,{"$f":"保存情報!F14","v":"井川遥"},{"$f":"保存情報!G14","v":"イガワハルカ"},{"$f":"保存情報!J14","v":3},{"$f":"保存情報!V14","v":59},{"$f":"保存情報!AI14","v":0},"－"]
[null,9,{"$f":"保存情報!F15","v":"石原さとみ"},{"$f":"保存情報!G15","v":"イシハラサトミ"},{"$f":"保存情報!J15","v":2},{"$f":"保存情報!V15","v":64},{"$f":"保存情報!AI15","v":0},"－"]
{"$rows_left_out":141}